{"text_format":"1","workbook":"xlsx","n_sheets":7,"sheets":["製品選択","LIST","注文画面","価格表","図","Table","設定"],"not_rendered":{"charts":0,"images":16,"macros":1,"external_links":0,"defined_names":2,"comments":0,"pivot_tables":0},"unopened":[],"bounds":{"document_bytes":16777216,"sheet_cells":100000,"rows_first":2000,"rows_last":500,"rows_between":2000,"halvings":0,"cell_chars":16384,"cell_head_chars":4096},"cells_cut":0,"cells_raw":0,"read":"whole","date_system":"1900"}

{"sheet":"製品選択","index":0,"n_rows":130,"n_cols":23,"rows_kept":130,"cut":false,"hidden":false,"merged":[[1,10,1,11],[130,10,130,11],[96,16,96,17]]}
[null,null,"CBOX","ヨコ","タテ","形状","色",null,null,null,"電子 カタログ",null,"品番・価格 検索システム"]
[null,null,{"$f":"C124","v":0},{"$f":"E111","v":{"$error":"#N/A"}},{"$f":"E115","v":{"$error":"#N/A"}},{"$f":"E117","v":0},{"$f":"E120","v":0},null,"品  番",null,{"$f":"IF(AND(H9,V9<>\"\"),\"AL\"&E106&E109&E110&E114&E117&E120&IF(C106=7,\"\",E124),\"\")","v":""},null,"金額",{"$f":"IF(AND(V9<>\"\",H9),IFERROR(VLOOKUP(IF(C110=10,1,0)+F111&IF(C114=10,1,0)+F115,価格表!I:M,5,FALSE)*IF(C114=10,1.5,IF(C110=10,1.3,1))+IF(C122=2,M122,0),\"問い合わせ\")+IF(C124=2,8000,0),\"\")","v":""}]
[]
[null,"hide","hide","hide","hide","hide","hide",null,null,null,null,null,null,null,null,null,null,"hide",null,null,"hide"]
["hide"]
["hide"]
["hide"]
["hide"]
["hide",null,null,null,null,null,null,{"$f":"COUNTIF(H10:H1048576,\"✔\")=6","v":false},null,null,null,null,null,null,null,null,null,null,null,null,null,true]
[null,null,"最終値","選択値","記号","計算用","デフォルト値"]
["hide"]
["hide"]
["hide"]
["hide"]
["hide"]
["hide"]
["hide"]
["hide"]
["hide"]
["hide"]
["hide"]
["hide"]
["hide"]
["hide"]
["hide",null,null,null,null,null,null,null,null,null,null,null,6]
["hide",null,null,null,null,null,null,null,null,null,null,null,"最終値"]
["hide",null,null,null,null,null,null,null,null,null,null,null,"選択値"]
["hide",null,null,null,null,null,null,null,null,null,null,null,"記号"]
["hide",null,null,null,null,null,null,null,null,null,null,null,"計算用"]
["hide",null,null,null,null,null,null,null,null,null,null,null,"デフォルト値"]
["hide"]
["hide"]
["hide"]
["hide"]
["hide"]
["hide"]
["hide"]
["hide"]
["hide"]
["hide"]
["hide"]
["hide"]
["hide"]
["hide"]
["hide"]
["hide"]
["hide"]
["hide"]
["hide"]
["hide"]
["hide"]
["hide"]
["hide"]
["hide"]
["hide"]
["hide"]
["hide"]
["hide"]
["hide"]
["hide"]
["hide"]
["hide"]
["hide"]
["hide"]
["hide"]
["hide"]
["hide"]
["hide"]
["hide"]
["hide"]
["hide"]
["hide"]
["hide"]
["hide"]
["hide"]
["hide"]
["hide"]
["hide"]
["hide"]
["hide"]
["hide"]
["hide"]
["hide"]
["hide"]
["hide"]
["hide"]
["hide"]
["hide"]
["hide"]
["hide"]
["hide"]
["hide"]
["hide"]
["hide"]
["hide"]
["hide"]
["hide",null,null,null,null,null,null,null,null,null,"幅長","奥行","形状","色","品番","特","特注size",null,"単価"]
["hide",null,null,null,null,null,null,null,null,null,{"$f":"INDIRECT(\"R\"&ROW(I110)&\"C\"&10+F111+IF(C110=10,1,0),FALSE)","v":0},{"$f":"INDIRECT(\"R\"&ROW(I114)&\"C\"&10+F115+IF(C114=10,1,0),FALSE)","v":0},{"$f":"INDIRECT(\"R117C\"&10+C117,FALSE)","v":0},{"$f":"INDIRECT(\"R120C\"&10+C120,FALSE)","v":0},{"$f":"K2","v":""},{"$f":"IF(OR(Q98>0,R98>0),\"●\",\"\")","v":""},{"$f":"V110","v":0},{"$f":"V114","v":0},{"$f":"N2","v":""}]
["hide"]
["hide"]
["hide"]
["hide",null,null,null,"記号",null,null,null,null,null,"AL","MC","GC"]
["hide","シリーズ",{"$f":"D103","v":0},null,{"$f":"INDIRECT(\"R[-1]C\" &D103+10,FALSE)","v":0},null,1,null,"シリーズ",null,"人工銘木","マット\nコーティング","グロス\nコーティング"]
[]
["hide",null,null,null,null,null,null,null,null,null,"C","T",null,null,null,null,"S"]
[null,"製品",{"$f":"D106","v":0},null,{"$f":"INDIRECT(\"R[-1]C\" &D106+10,FALSE)","v":0},null,3,{"$f":"IF(C106=0,\"\",\"✔\")","v":""},"用 途",null,"カウンター","テーブル天板","テーブル +脚",null,null,null,"サンプル"]
[null,null,null,null,null,null,null,null,null,null,null,null,null,null,null,null,null,null,null,null,null,"最大値2300mm"]
["hide",null,null,null,null,null,null,null,null,null,"060","075",110,150,180,230,null,null,null,"XXX"]
["hide",null,null,null,null,null,null,null,null,null,{"$f":"IF($E$106=\"S\",\"\",K108)","v":"060"},"075",110,150,180,230,{"$f":"IF($E$106=\"S\",\"030\",\"\")","v":""},null,null,{"$f":"IF($E$106=\"S\",\"\",T108)","v":"XXX"}]
[null,"巾",{"$f":"IF(C106=7,7,IF(INDIRECT(\"R[-1]C\"&D110+10,FALSE)=\"\",0,IF(D110<10,D110,IF(F110>0,F110,10))))","v":0},null,{"$f":"IF(C110=10,\"XXX\",INDIRECT(\"R[-1]C\"&F111+10+IF(C110=10,1,0),FALSE))","v":0},{"$f":"IFERROR(MATCH(V110,K110:P110,0),0)","v":0},3,{"$f":"IF(C110=0,\"\",\"✔\")","v":""},"巾 長",null,600,750,1100,1500,1800,2300,300,null,null,"幅  特注",null,null,1.3]
[null,null,null,null,{"$f":"IF(C110=10,V110,HLOOKUP(E110,K109:Q110,2,FALSE))","v":{"$error":"#N/A"}},{"$f":"IF(C106=7,7,IF(D110=10,IFERROR(MATCH(V110,K110:P110,1),0),D110))","v":0},null,null,null,null,null,null,null,null,null,null,null,null,null,null,null,"最大値1100mm"]
["hide",null,null,null,null,null,null,null,null,null,45,60,75,90,"E1",null,null,null,null,"XX"]
["hide",null,null,null,null,null,null,null,null,null,{"$f":"IF($E$106=\"S\",\"\",K112)","v":45},{"$f":"IF($E$106=\"S\",\"\",L112)","v":60},75,90,"E1",null,{"$f":"IF($E$106=\"S\",\"20\",\"\")","v":""},null,null,{"$f":"IF($E$106=\"S\",\"\",T112)","v":"XX"}]
[null,"奥行",{"$f":"IF(C106=7,7,IF(INDIRECT(\"R[-1]C\"&D114+10,FALSE)=\"\",0,IF(D114<10,D114,IF(F114>0,F114,10))))","v":0},null,{"$f":"IF(C114=10,\"XX\",INDIRECT(\"R[-1]C\" &F115+10+IF(C114=10,1,0),FALSE))","v":0},{"$f":"IFERROR(MATCH(V114,K114:P114,0),0)","v":0},3,{"$f":"IF(C114=0,\"\",\"✔\")","v":""},"奥 行",null,450,600,750,900,1100,null,200,null,null,"奥行 特注",null,null,1.5]
[null,null,null,null,{"$f":"IF(C114=10,V114,HLOOKUP(E114,K113:Q114,2,FALSE))","v":{"$error":"#N/A"}},{"$f":"IF(C106=7,7,IF(D114=10,IFERROR(MATCH(V114,K114:P114,1),0),D114))","v":0},null,null,null,null,{"$f":"IF($E$106=\"C\",\"\",\"WW\")","v":"WW"},{"$f":"IF($E$106=\"C\",\"\",\"TT\")","v":"TT"},"SS",{"$f":"IF($E$106=\"C\",\"\",\"WT\")","v":"WT"},{"$f":"IF($E$106=\"T\",\"\",\"WS\")","v":"WS"},{"$f":"IF($E$106=\"T\",\"\",\"TS\")","v":"TS"}]
["hide",null,null,null,null,null,null,null,null,null,"WW","TT","SS","WT",{"$f":"IF($E$106=\"T\",\"\",\"WS\")","v":"WS"},{"$f":"IF($E$106=\"T\",\"\",\"TS\")","v":"TS"}]
[null,"形状",{"$f":"IF(E117=\"\",0,D117)","v":0},null,{"$f":"INDIRECT(\"R[-1]C\" &D117+10,FALSE)","v":0},null,4,{"$f":"IF(C117=0,\"\",\"✔\")","v":""},"長木口形状",null,"波+波","テーパー+テーパー","垂直+垂直","波+テーパー","波+垂直","テーパー+垂直"]
[]
["hide",null,null,null,null,null,null,null,null,null,"NO","DO"]
[null,"色",{"$f":"D120","v":0},null,{"$f":"INDIRECT(\"R[-1]C\" &D120+10,FALSE)","v":0},null,2,{"$f":"IF(C120=0,\"\",\"✔\")","v":""},"色 柄",null,"ナチュラル オーク","ダーク オーク"]
[]
["hide",null,null,null,null,null,null,null,"オプション"]
["hide",null,null,null,null,null,null,null,null,null,1,{"$f":"IF(C110=7,\"\",5)","v":5}]
[null,"色",{"$f":"IF(E124=\"\",0,D124)","v":0},null,{"$f":"INDIRECT(\"R[-1]C\" &D124+10,FALSE)","v":0},null,1,{"$f":"IF(C124=0,\"\",\"✔\")","v":""},"コンセントBOX",null,"無","有 \\8,000"]
["hide"]
["hide",null,null,null,null,null,null,null,null,null,"T","R","S","G"]
["hide","色",{"$f":"D127","v":0},null,{"$f":"INDIRECT(\"R[-1]C\" &D127+10,FALSE)","v":0},null,1,null,"脚",null,"トラペ","長方形","スラント","木脚"]
["hide"]
["hide",null,null,null,null,null,null,null,null,null,"B","W","V",null,"N","D"]
["hide","色",{"$f":"D130","v":0},null,{"$f":"INDIRECT(\"R[-1]C\" &D130+10,FALSE)","v":0},null,1,null,"脚色",null,"黒","白","ベージュ",null,"ナチュラル","ダーク"]

{"sheet":"LIST","index":1,"n_rows":14,"n_cols":14,"rows_kept":14,"cut":false,"hidden":true,"merged":[[9,8,9,9],[3,1,3,2],[3,3,3,4]]}
[null,"※ 選択画面の仕様をリスト化します"]
[null,"見積リスト"]
[]
[null,"合 計",null,{"$f":"SUM(M:M)","v":144000}]
[]
[]
[]
[]
[]
[null,"No","幅長","奥行","形状","色","品番","特","特注size",null,"単価","数量","金額","メモ"]
[null,1,1100,900,"波+波","ダーク オーク","ALT11090WWDO5",null,0,0,69000,1,{"$f":"L11*K11","v":69000}]
[null,2,1100,900,"テーパー+テーパー","ナチュラル オーク","ALT11090TTNO5",null,0,0,69000,1,{"$f":"L12*K12","v":69000}]
[null,3,300,200,"テーパー+テーパー","ナチュラル オーク","ALS03020TTNO",null,0,0,3000,1,{"$f":"L13*K13","v":3000}]
[null,4,300,200,"テーパー+テーパー","ナチュラル オーク","ALS03020TTNO",null,0,0,3000,1,{"$f":"L14*K14","v":3000}]

{"sheet":"注文画面","index":2,"n_rows":22,"n_cols":5,"rows_kept":22,"cut":false,"hidden":true,"merged":[[19,3,19,4],[21,1,21,2],[21,3,21,4],[4,3,4,4],[4,1,4,2],[18,1,18,2],[18,3,18,4],[2,3,2,4],[6,1,6,2],[12,1,12,2],[10,1,10,2],[14,1,14,2],[6,3,6,4],[8,1,8,2]]}
[null,null,null,"注文画面"]
[null,null,"code"]
[null,"発注元"]
[]
[null,"注  番"]
[]
[null,"品  番",null,{"$f":"製品選択!K2","v":""}]
[]
[null,"サイズ",null,{"$f":"IFERROR(製品選択!E111,\"\")","v":""},{"$f":"IFERROR(製品選択!E115,\"\")","v":""}]
[]
[null,"単  価",null,{"$f":"製品選択!N2","v":""}]
[]
[null,"数  量"]
[]
[null,"注文金額",null,{"$f":"IFERROR(D11*D13,0)","v":0}]
[]
[null,"希望納期"]
[]
[null,"納入場所"]
[]
[]
[null,"備考"]

{"sheet":"価格表","index":3,"n_rows":32,"n_cols":14,"rows_kept":32,"cut":false,"hidden":true,"merged":[]}
[null,null,null,null,null,null,null,null,"KEY","選択サイズ","H","D","単価"]
[null,"人工銘木   価格表 (定価)",null,null,null,null,null,null,{"$f":"_xlfn.XLOOKUP(K2,Table!F:F,Table!A:A)&_xlfn.XLOOKUP(価格表!L2,Table!B:B,Table!A:A)","v":"11"},{"$f":"VLOOKUP(K2,Table!F:G,2,FALSE)&VLOOKUP(L2,Table!B:D,3,FALSE)","v":"06045"},600,450,20000,{"$f":"M2*1.3","v":26000}]
[null,null,null,null,null,null,null,null,{"$f":"_xlfn.XLOOKUP(K3,Table!F:F,Table!A:A)&_xlfn.XLOOKUP(価格表!L3,Table!B:B,Table!A:A)","v":"21"},{"$f":"VLOOKUP(K3,Table!F:G,2,FALSE)&VLOOKUP(L3,Table!B:D,3,FALSE)","v":"07545"},750,450,24500,{"$f":"M3*1.3","v":31850}]
[null,"定価（税抜き）",null,null,null,null,null,null,{"$f":"_xlfn.XLOOKUP(K4,Table!F:F,Table!A:A)&_xlfn.XLOOKUP(価格表!L4,Table!B:B,Table!A:A)","v":"31"},{"$f":"VLOOKUP(K4,Table!F:G,2,FALSE)&VLOOKUP(L4,Table!B:D,3,FALSE)","v":"11045"},1100,450,34000,44200]
[null,null,600,750,1100,1500,1800,2300,{"$f":"_xlfn.XLOOKUP(K5,Table!F:F,Table!A:A)&_xlfn.XLOOKUP(価格表!L5,Table!B:B,Table!A:A)","v":"41"},{"$f":"VLOOKUP(K5,Table!F:G,2,FALSE)&VLOOKUP(L5,Table!B:D,3,FALSE)","v":"15045"},1500,450,44000,57200]
[null,450,20000,24500,34000,44000,50000,64000,{"$f":"_xlfn.XLOOKUP(K6,Table!F:F,Table!A:A)&_xlfn.XLOOKUP(価格表!L6,Table!B:B,Table!A:A)","v":"51"},{"$f":"VLOOKUP(K6,Table!F:G,2,FALSE)&VLOOKUP(L6,Table!B:D,3,FALSE)","v":"18045"},1800,450,50000,65000]
[null,600,23000,28500,40000,52000,59500,76000,{"$f":"_xlfn.XLOOKUP(K7,Table!F:F,Table!A:A)&_xlfn.XLOOKUP(価格表!L7,Table!B:B,Table!A:A)","v":"61"},{"$f":"VLOOKUP(K7,Table!F:G,2,FALSE)&VLOOKUP(L7,Table!B:D,3,FALSE)","v":"23045"},2300,450,64000,83200]
[null,750,30000,36500,51000,66500,76500,97000,{"$f":"_xlfn.XLOOKUP(K8,Table!F:F,Table!A:A)&_xlfn.XLOOKUP(価格表!L8,Table!B:B,Table!A:A)","v":"12"},{"$f":"VLOOKUP(K8,Table!F:G,2,FALSE)&VLOOKUP(L8,Table!B:D,3,FALSE)","v":"06060"},600,600,23000,29900]
[null,900,35000,43000,61000,79000,90000,116000,{"$f":"_xlfn.XLOOKUP(K9,Table!F:F,Table!A:A)&_xlfn.XLOOKUP(価格表!L9,Table!B:B,Table!A:A)","v":"22"},{"$f":"VLOOKUP(K9,Table!F:G,2,FALSE)&VLOOKUP(L9,Table!B:D,3,FALSE)","v":"07560"},750,600,28500,37050]
[null,1100,37000,45000,64000,83000,95000,121000,{"$f":"_xlfn.XLOOKUP(K10,Table!F:F,Table!A:A)&_xlfn.XLOOKUP(価格表!L10,Table!B:B,Table!A:A)","v":"32"},{"$f":"VLOOKUP(K10,Table!F:G,2,FALSE)&VLOOKUP(L10,Table!B:D,3,FALSE)","v":"11060"},1100,600,40000,52000]
[null,null,null,null,null,null,null,null,{"$f":"_xlfn.XLOOKUP(K11,Table!F:F,Table!A:A)&_xlfn.XLOOKUP(価格表!L11,Table!B:B,Table!A:A)","v":"42"},{"$f":"VLOOKUP(K11,Table!F:G,2,FALSE)&VLOOKUP(L11,Table!B:D,3,FALSE)","v":"15060"},1500,600,52000,67600]
[null,null,null,null,null,null,null,null,{"$f":"_xlfn.XLOOKUP(K12,Table!F:F,Table!A:A)&_xlfn.XLOOKUP(価格表!L12,Table!B:B,Table!A:A)","v":"52"},{"$f":"VLOOKUP(K12,Table!F:G,2,FALSE)&VLOOKUP(L12,Table!B:D,3,FALSE)","v":"18060"},1800,600,59500,77350]
[null,null,null,null,null,null,null,null,{"$f":"_xlfn.XLOOKUP(K13,Table!F:F,Table!A:A)&_xlfn.XLOOKUP(価格表!L13,Table!B:B,Table!A:A)","v":"62"},{"$f":"VLOOKUP(K13,Table!F:G,2,FALSE)&VLOOKUP(L13,Table!B:D,3,FALSE)","v":"23060"},2300,600,76000,98800]
[null,null,null,null,null,null,null,null,{"$f":"_xlfn.XLOOKUP(K14,Table!F:F,Table!A:A)&_xlfn.XLOOKUP(価格表!L14,Table!B:B,Table!A:A)","v":"13"},{"$f":"VLOOKUP(K14,Table!F:G,2,FALSE)&VLOOKUP(L14,Table!B:D,3,FALSE)","v":"06075"},600,750,30000,39000]
[null,null,null,null,null,null,null,null,{"$f":"_xlfn.XLOOKUP(K15,Table!F:F,Table!A:A)&_xlfn.XLOOKUP(価格表!L15,Table!B:B,Table!A:A)","v":"23"},{"$f":"VLOOKUP(K15,Table!F:G,2,FALSE)&VLOOKUP(L15,Table!B:D,3,FALSE)","v":"07575"},750,750,36500,47450]
[null,null,null,null,null,null,null,null,{"$f":"_xlfn.XLOOKUP(K16,Table!F:F,Table!A:A)&_xlfn.XLOOKUP(価格表!L16,Table!B:B,Table!A:A)","v":"33"},{"$f":"VLOOKUP(K16,Table!F:G,2,FALSE)&VLOOKUP(L16,Table!B:D,3,FALSE)","v":"11075"},1100,750,51000,66300]
[null,null,null,null,null,null,null,null,{"$f":"_xlfn.XLOOKUP(K17,Table!F:F,Table!A:A)&_xlfn.XLOOKUP(価格表!L17,Table!B:B,Table!A:A)","v":"43"},{"$f":"VLOOKUP(K17,Table!F:G,2,FALSE)&VLOOKUP(L17,Table!B:D,3,FALSE)","v":"15075"},1500,750,66500,86450]
[null,null,null,null,null,null,null,null,{"$f":"_xlfn.XLOOKUP(K18,Table!F:F,Table!A:A)&_xlfn.XLOOKUP(価格表!L18,Table!B:B,Table!A:A)","v":"53"},{"$f":"VLOOKUP(K18,Table!F:G,2,FALSE)&VLOOKUP(L18,Table!B:D,3,FALSE)","v":"18075"},1800,750,76500,99450]
[null,null,null,null,null,null,null,null,{"$f":"_xlfn.XLOOKUP(K19,Table!F:F,Table!A:A)&_xlfn.XLOOKUP(価格表!L19,Table!B:B,Table!A:A)","v":"63"},{"$f":"VLOOKUP(K19,Table!F:G,2,FALSE)&VLOOKUP(L19,Table!B:D,3,FALSE)","v":"23075"},2300,750,97000,126100]
[null,null,null,null,null,null,null,null,{"$f":"_xlfn.XLOOKUP(K20,Table!F:F,Table!A:A)&_xlfn.XLOOKUP(価格表!L20,Table!B:B,Table!A:A)","v":"14"},{"$f":"VLOOKUP(K20,Table!F:G,2,FALSE)&VLOOKUP(L20,Table!B:D,3,FALSE)","v":"06090"},600,900,35000,45500]
[null,null,null,null,null,null,null,null,{"$f":"_xlfn.XLOOKUP(K21,Table!F:F,Table!A:A)&_xlfn.XLOOKUP(価格表!L21,Table!B:B,Table!A:A)","v":"24"},{"$f":"VLOOKUP(K21,Table!F:G,2,FALSE)&VLOOKUP(L21,Table!B:D,3,FALSE)","v":"07590"},750,900,43000,55900]
[null,null,null,null,null,null,null,null,{"$f":"_xlfn.XLOOKUP(K22,Table!F:F,Table!A:A)&_xlfn.XLOOKUP(価格表!L22,Table!B:B,Table!A:A)","v":"34"},{"$f":"VLOOKUP(K22,Table!F:G,2,FALSE)&VLOOKUP(L22,Table!B:D,3,FALSE)","v":"11090"},1100,900,61000,79300]
[null,null,null,null,null,null,null,null,{"$f":"_xlfn.XLOOKUP(K23,Table!F:F,Table!A:A)&_xlfn.XLOOKUP(価格表!L23,Table!B:B,Table!A:A)","v":"44"},{"$f":"VLOOKUP(K23,Table!F:G,2,FALSE)&VLOOKUP(L23,Table!B:D,3,FALSE)","v":"15090"},1500,900,79000,102700]
[null,null,null,null,null,null,null,null,{"$f":"_xlfn.XLOOKUP(K24,Table!F:F,Table!A:A)&_xlfn.XLOOKUP(価格表!L24,Table!B:B,Table!A:A)","v":"54"},{"$f":"VLOOKUP(K24,Table!F:G,2,FALSE)&VLOOKUP(L24,Table!B:D,3,FALSE)","v":"18090"},1800,900,90000,117000]
[null,null,null,null,null,null,null,null,{"$f":"_xlfn.XLOOKUP(K25,Table!F:F,Table!A:A)&_xlfn.XLOOKUP(価格表!L25,Table!B:B,Table!A:A)","v":"64"},{"$f":"VLOOKUP(K25,Table!F:G,2,FALSE)&VLOOKUP(L25,Table!B:D,3,FALSE)","v":"23090"},2300,900,116000,150800]
[null,null,null,null,null,null,null,null,{"$f":"_xlfn.XLOOKUP(K26,Table!F:F,Table!A:A)&_xlfn.XLOOKUP(価格表!L26,Table!B:B,Table!A:A)","v":"15"},{"$f":"VLOOKUP(K26,Table!F:G,2,FALSE)&VLOOKUP(L26,Table!B:D,3,FALSE)","v":"060E1"},600,1100,37000,48100]
[null,null,null,null,null,null,null,null,{"$f":"_xlfn.XLOOKUP(K27,Table!F:F,Table!A:A)&_xlfn.XLOOKUP(価格表!L27,Table!B:B,Table!A:A)","v":"25"},{"$f":"VLOOKUP(K27,Table!F:G,2,FALSE)&VLOOKUP(L27,Table!B:D,3,FALSE)","v":"075E1"},750,1100,45000,58500]
[null,null,null,null,null,null,null,null,{"$f":"_xlfn.XLOOKUP(K28,Table!F:F,Table!A:A)&_xlfn.XLOOKUP(価格表!L28,Table!B:B,Table!A:A)","v":"35"},{"$f":"VLOOKUP(K28,Table!F:G,2,FALSE)&VLOOKUP(L28,Table!B:D,3,FALSE)","v":"110E1"},1100,1100,64000,83200]
[null,null,null,null,null,null,null,null,{"$f":"_xlfn.XLOOKUP(K29,Table!F:F,Table!A:A)&_xlfn.XLOOKUP(価格表!L29,Table!B:B,Table!A:A)","v":"45"},{"$f":"VLOOKUP(K29,Table!F:G,2,FALSE)&VLOOKUP(L29,Table!B:D,3,FALSE)","v":"150E1"},1500,1100,83000,107900]
[null,null,null,null,null,null,null,null,{"$f":"_xlfn.XLOOKUP(K30,Table!F:F,Table!A:A)&_xlfn.XLOOKUP(価格表!L30,Table!B:B,Table!A:A)","v":"55"},{"$f":"VLOOKUP(K30,Table!F:G,2,FALSE)&VLOOKUP(L30,Table!B:D,3,FALSE)","v":"180E1"},1800,1100,95000,123500]
[null,null,null,null,null,null,null,null,{"$f":"_xlfn.XLOOKUP(K31,Table!F:F,Table!A:A)&_xlfn.XLOOKUP(価格表!L31,Table!B:B,Table!A:A)","v":"65"},{"$f":"VLOOKUP(K31,Table!F:G,2,FALSE)&VLOOKUP(L31,Table!B:D,3,FALSE)","v":"230E1"},2300,1100,121000,157300]
[null,null,null,null,null,null,null,null,"77","03002",300,200,3000,3900]

{"sheet":"図","index":4,"n_rows":23,"n_cols":49,"rows_kept":23,"cut":false,"hidden":true,"merged":[]}
[null,null,null,1,null,2,null,3,null,4,null,5,null,6,null,7,null,8,null,9,null,1,0,1,1,1,2,1,3,1,4,1,5,1,6,1,7,1,8,1,9,2,0,2,1,2,2,2,3]
[]
[null,1]
[]
[null,2]
[]
[null,3]
[]
[null,4]
[]
[null,5]
[]
[null,6]
[]
[null,7]
[]
[null,8]
[]
[null,9]
[]
[null,10]
[]
[null,11]

{"sheet":"Table","index":5,"n_rows":12,"n_cols":10,"rows_kept":12,"cut":false,"hidden":true,"merged":[]}
[]
[]
["選択","奥行","図形行","記号"]
[0,null,0,null,null,null,null,null,null,450]
[1,450,5,45,null,600,"060",null,null,600]
[2,600,5,60,null,750,"075",null,null,750]
[3,750,6,75,null,1100,110,null,null,900]
[4,900,6,90,null,1500,150,null,null,1100]
[5,1100,7,"E1",null,1800,180]
[6,null,null,null,null,2300,230]
[7,200,5,20,null,300,"030"]
[10,null,{"$f":"IF(製品選択!D114=10,VLOOKUP(製品選択!F115,Table!A5:C9,3,FALSE),0)","v":0}]

{"sheet":"設定","index":6,"n_rows":4,"n_cols":3,"rows_kept":4,"cut":false,"hidden":true,"merged":[]}
[]
[null,"設定"]
[]
[null,"メンテモード",false]