{"text_format":"1","workbook":"xlsx","n_sheets":16,"sheets":["Table","製品選択","標準","組合せコーナーSET","一体コーナー","LIST","図面LIST","csv","価格表","図","C図","Cset図","CTable","C価格表","木口形状","設定"],"not_rendered":{"charts":0,"images":29,"macros":1,"external_links":0,"defined_names":19,"comments":0,"pivot_tables":0},"unopened":[],"bounds":{"document_bytes":16777216,"sheet_cells":100000,"rows_first":2000,"rows_last":500,"rows_between":2000,"halvings":0,"cell_chars":16384,"cell_head_chars":4096},"cells_cut":0,"cells_raw":0,"read":"whole","date_system":"1900"}

{"sheet":"Table","index":0,"n_rows":12,"n_cols":10,"rows_kept":12,"cut":false,"hidden":true,"merged":[]}
[]
[]
["選択","奥行","図形行","記号",null,"巾","記号","Key"]
[0,null,0,null,null,null,null,null,null,450]
[1,450,5,45,null,600,"060",1,null,600]
[2,600,5,60,null,750,"075",2,null,750]
[3,750,6,75,null,1100,110,3,null,900]
[4,900,6,90,null,1500,150,4,null,1100]
[5,1100,7,"E1",null,1800,180,5]
[6,null,null,null,null,2300,230,6]
[7,200,5,20,null,300,"030",7]
[10,null,{"$f":"IF(#REF!=10,VLOOKUP(#REF!,Table!A5:C9,3,FALSE),0)","v":{"$error":"#REF!"}}]

{"sheet":"製品選択","index":1,"n_rows":0,"n_cols":0,"rows_kept":0,"cut":false,"hidden":false,"merged":[[8,4,8,6],[8,7,8,10]]}

{"sheet":"標準","index":2,"n_rows":140,"n_cols":23,"rows_kept":140,"cut":false,"hidden":false,"merged":[[1,10,1,11],[140,10,140,11],[123,8,123,11]]}
[null,null,"CBOX","ヨコ","タテ","形状","色",null,null,null,"標準　長方形"]
[null,null,{"$f":"C134","v":0},{"$f":"E111","v":{"$error":"#N/A"}},{"$f":"E115","v":{"$error":"#N/A"}},{"$f":"E117","v":0},{"$f":"E120","v":0},null,"品  番",null,{"$f":"IF(AND(H9,V9<>\"\"),O98,\"\")","v":""},null,"金額",{"$f":"T98","v":""}]
[]
[null,"hide","hide","hide","hide","hide","hide",null,null,null,null,null,null,null,null,null,null,"hide",null,null,"hide"]
["hide"]
["hide"]
["hide"]
["hide"]
["hide",null,null,null,null,null,null,{"$f":"COUNTIF($H$103:$H$120,\"✔\")>=5","v":false},null,null,null,null,null,null,null,null,null,null,null,null,null,true]
[null,null,"最終値","選択値","記号","計算用","デフォルト値"]
["hide"]
["hide"]
["hide"]
["hide"]
["hide"]
["hide"]
["hide"]
["hide"]
["hide"]
["hide"]
["hide"]
["hide"]
["hide"]
["hide"]
["hide",null,null,null,null,null,null,null,null,null,null,null,6]
["hide",null,null,null,null,null,null,null,null,null,null,null,"最終値"]
["hide",null,null,null,null,null,null,null,null,null,null,null,"選択値"]
["hide",null,null,null,null,null,null,null,null,null,null,null,"記号"]
["hide",null,null,null,null,null,null,null,null,null,null,null,"計算用"]
["hide",null,null,null,null,null,null,null,null,null,null,null,"デフォルト値"]
["hide"]
["hide"]
["hide"]
["hide"]
["hide"]
["hide"]
["hide"]
["hide"]
["hide"]
["hide"]
["hide"]
["hide"]
["hide"]
["hide"]
["hide"]
["hide"]
["hide"]
["hide"]
["hide"]
["hide"]
["hide"]
["hide"]
["hide"]
["hide"]
["hide"]
["hide"]
["hide"]
["hide"]
["hide"]
["hide"]
["hide"]
["hide"]
["hide"]
["hide"]
["hide"]
["hide"]
["hide"]
["hide"]
["hide"]
["hide"]
["hide"]
["hide"]
["hide"]
["hide"]
["hide"]
["hide"]
["hide"]
["hide"]
["hide"]
["hide"]
["hide"]
["hide"]
["hide"]
["hide"]
["hide"]
["hide"]
["hide"]
["hide"]
["hide"]
["hide"]
["hide"]
["hide"]
["hide"]
["hide",null,null,null,null,null,null,null,null,null,null,null,null,null,null,null,"金額倍率"]
["hide",null,null,null,null,null,null,null,null,null,null,{"$f":"LEFT(M98,1)","v":"0"},{"$f":"MID(M98,2,1)","v":"S"},{"$f":"IF(E127=0,\"S\",E127)","v":"S"},{"$f":"IF(E130=0,\"S\",E130)","v":"S"},{"$f":"IF(AND(C110=10,C114=10),\"Z\",IF(C110=10,\"W\",IF(C114=10,\"D\",\"N\")))","v":"N"},{"$f":"IF(P95=\"Z\",1.5,IF(P95=\"N\",1,1.3))","v":1}]
["hide"]
["hide",null,null,null,null,null,null,null,null,null,"幅長","奥行","形状","色","品番","特","品名",null,"単価","単価","重量"]
["hide",null,null,null,null,null,null,null,null,null,{"$f":"IF(Q99>0,Q99,INDIRECT(\"R\"&ROW(I110)&\"C\"&10+F111+IF(C110=10,1,0),FALSE))","v":0},{"$f":"IF(R99>0,R99,INDIRECT(\"R\"&ROW(I114)&\"C\"&10+F115+IF(C114=10,1,0),FALSE))","v":0},{"$f":"E117&N95&O95","v":"0SS"},{"$f":"INDIRECT(\"R120C\"&10+C120,FALSE)","v":0},{"$f":"\"A\"&E106&E109&E110&E114&M98&E120&IF(C106=7,\"\",E134&P95)","v":"A0000SS00N"},{"$f":"IF(OR(Q99>0,R99>0),\"●\",\"\")","v":""},{"$f":"F106","v":{"$error":"#N/A"}},null,1,{"$f":"IF(AND(V9<>\"\",H9),IFERROR(VLOOKUP(IF(C110=10,1,0)+F111&IF(C114=10,1,0)+F115,価格表!I:M,5,FALSE)*$Q$95,\"問い合わせ\")+IF(C134=2,8000,0)+IF(C127>0,8000,0)+IF(C130>0,8000,0),\"\")","v":""},{"$f":"K98*L98*30*0.7/1000/1000","v":0}]
["hide",null,null,null,null,null,null,null,null,null,null,null,null,null,null,null,{"$f":"V110","v":0},{"$f":"V114","v":0}]
["hide"]
["hide"]
["hide",null,null,null,"記号",null,null,null,null,null,"AL","MC","GC"]
["hide","シリーズ",{"$f":"D103","v":0},null,{"$f":"INDIRECT(\"R[-1]C\" &D103+10,FALSE)","v":0},null,1,null,"シリーズ",null,"人工銘木","マット\nコーティング","グロス\nコーティング"]
[]
["hide",null,null,null,null,null,null,null,null,null,"C","T",null,null,null,null,"S"]
[null,"製品",{"$f":"D106","v":0},null,{"$f":"INDIRECT(\"R[-1]C\" &D106+10,FALSE)","v":0},{"$f":"HLOOKUP(E106,K105:Q106,2,FALSE)","v":{"$error":"#N/A"}},3,{"$f":"IF(C106=0,\"\",\"✔\")","v":""},"用 途",null,"カウンター","テーブル天板","テーブル +脚",null,null,null,"サンプル"]
[null,null,null,null,null,null,null,null,null,null,null,null,null,null,null,null,null,null,null,null,null,"最大値2300mm"]
["hide",null,null,null,null,null,null,null,null,null,"060","075",110,150,180,230,null,null,null,"XXX"]
["hide",null,null,null,null,null,null,null,null,null,{"$f":"IF($E$106=\"S\",\"\",K108)","v":"060"},"075",110,150,180,230,{"$f":"IF($E$106=\"S\",\"030\",\"\")","v":""},null,null,{"$f":"IF($E$106=\"S\",\"\",T108)","v":"XXX"}]
[null,"巾",{"$f":"IF(C106=7,7,IF(INDIRECT(\"R[-1]C\"&D110+10,FALSE)=\"\",0,IF(D110<10,D110,IF(F110>0,F110,10))))","v":0},null,{"$f":"INDIRECT(\"R[-1]C\"&F111+10+IF(C110=10,1,0),FALSE)","v":0},{"$f":"IFERROR(MATCH(V110,K110:P110,0),0)","v":0},3,{"$f":"IF(C110=0,\"\",\"✔\")","v":""},"巾 長",null,600,750,1100,1500,1800,2300,300,null,null,"幅  特注",null,null,1.3]
[null,null,null,null,{"$f":"IF(C110=10,V110,HLOOKUP(E110,K109:Q110,2,FALSE))","v":{"$error":"#N/A"}},{"$f":"IF(C106=7,7,IF(D110=10,IFERROR(MATCH(V110,K110:P110,1),0),D110))","v":0},null,null,null,null,null,null,null,null,null,null,null,null,null,null,null,"最大値1100mm"]
["hide",null,null,null,null,null,null,null,null,null,45,60,75,90,"E1",null,null,null,null,"XX"]
["hide",null,null,null,null,null,null,null,null,null,{"$f":"IF($E$106=\"S\",\"\",K112)","v":45},{"$f":"IF($E$106=\"S\",\"\",L112)","v":60},{"$f":"IF($E$106=\"S\",\"\",M112)","v":75},{"$f":"IF($E$106=\"S\",\"\",N112)","v":90},{"$f":"IF($E$106=\"S\",\"\",O112)","v":"E1"},null,{"$f":"IF($E$106=\"S\",\"20\",\"\")","v":""},null,null,{"$f":"IF($E$106=\"S\",\"\",T112)","v":"XX"}]
[null,"奥行",{"$f":"IF(C106=7,7,IF(INDIRECT(\"R[-1]C\"&D114+10,FALSE)=\"\",0,IF(D114<10,D114,IF(F114>0,F114,10))))","v":0},null,{"$f":"INDIRECT(\"R[-1]C\" &F115+10+IF(C114=10,1,0),FALSE)","v":0},{"$f":"IFERROR(MATCH(V114,K114:P114,0),0)","v":0},3,{"$f":"IF(C114=0,\"\",\"✔\")","v":""},"奥 行",null,450,600,750,900,1100,null,200,null,null,"奥行 特注",null,null,1.3]
[null,null,null,null,{"$f":"IF(C114=10,V114,HLOOKUP(E114,K113:Q114,2,FALSE))","v":{"$error":"#N/A"}},{"$f":"IF(C106=7,7,IF(D114=10,IFERROR(MATCH(V114,K114:P114,1),0),D114))","v":0},null,null,null,null,{"$f":"IF($E$106=\"C\",\"\",\"WW\")","v":"WW"},{"$f":"IF($E$106=\"C\",\"\",\"TT\")","v":"TT"},"SS",{"$f":"IF($E$106=\"C\",\"\",\"WT\")","v":"WT"},{"$f":"IF($E$106=\"T\",\"\",\"WS\")","v":"WS"},{"$f":"IF($E$106=\"T\",\"\",\"TS\")","v":"TS"}]
["hide",null,null,null,null,null,null,null,null,null,"WW","TT","SS","TW","SW","ST"]
[null,"形状",{"$f":"IF(E117=\"\",0,D117)","v":0},null,{"$f":"INDIRECT(\"R[-1]C\" &D117+10,FALSE)","v":0},null,4,{"$f":"IF(C117=0,\"\",\"✔\")","v":""},"長木口形状",null,"波+波","テーパー+テーパー","垂直+垂直","波+テーパー","波+垂直","テーパー+垂直"]
[]
["hide",null,null,null,null,null,null,null,null,null,"NO","DO"]
[null,"色柄",{"$f":"D120","v":0},null,{"$f":"INDIRECT(\"R[-1]C\" &D120+10,FALSE)","v":0},null,2,{"$f":"IF(C120=0,\"\",\"✔\")","v":""},"色 柄",null,"ナチュラル オーク","ダーク オーク"]
[]
[null,null,null,null,null,null,null,null,"OK をクリックして\n形状と価格を確認"]
[]
[null,null,null,null,null,null,null,null,"オプション"]
[]
["hide",null,null,null,null,null,null,null,null,null,"T","W"]
[null,"形状",{"$f":"IF(E127=\"\",0,D127)","v":0},null,{"$f":"INDIRECT(\"R[-1]C\" &D127+10,FALSE)","v":0},null,4,{"$f":"IF(C127=0,\"\",\"✔\")","v":""},"短 左木口形状",null,"テーパー","波"]
[]
["hide",null,null,null,null,null,null,null,null,null,"T","W"]
[null,"形状",{"$f":"IF(E130=\"\",0,D130)","v":0},null,{"$f":"INDIRECT(\"R[-1]C\" &D130+10,FALSE)","v":0},null,4,{"$f":"IF(C130=0,\"\",\"✔\")","v":""},"短 右木口形状",null,"テーパー","波"]
[]
["hide",null,null,null,null,null,null,null,"オプション"]
["hide",null,null,null,null,null,null,null,null,null,1,{"$f":"IF(C110=7,\"\",5)","v":5}]
[null,"色",{"$f":"IF(E134=\"\",0,D134)","v":0},null,{"$f":"INDIRECT(\"R[-1]C\" &D134+10,FALSE)","v":0},null,1,{"$f":"IF(C134=0,\"\",\"✔\")","v":""},"コンセントBOX",null,"無","有 \\8,000"]
["hide"]
["hide",null,null,null,null,null,null,null,null,null,"T","R","S","G"]
["hide","色",{"$f":"D137","v":0},null,{"$f":"INDIRECT(\"R[-1]C\" &D137+10,FALSE)","v":0},null,1,null,"脚",null,"トラペ","長方形","スラント","木脚"]
["hide"]
["hide",null,null,null,null,null,null,null,null,null,"B","W","V",null,"N","D"]
["hide","色",{"$f":"D140","v":0},null,{"$f":"INDIRECT(\"R[-1]C\" &D140+10,FALSE)","v":0},null,1,null,"脚色",null,"黒","白","ベージュ",null,"ナチュラル","ダーク"]

{"sheet":"組合せコーナーSET","index":3,"n_rows":127,"n_cols":21,"rows_kept":127,"cut":false,"hidden":false,"merged":[[126,11,126,12],[0,10,0,12],[107,8,107,9],[115,8,115,9],[111,8,111,9],[113,8,113,9],[105,8,105,9],[1,11,1,12],[109,8,109,9],[117,8,117,9],[123,7,123,11],[119,8,119,9],[121,8,121,9],[103,8,103,9]]}
[null,null,"CBOX","ヨコ","タテ","形状","色",null,null,null,"組合せ コーナーカウンター\n45°カット"]
[null,null,null,{"$f":"L106","v":2300},{"$f":"L111","v":0},null,{"$f":"E127","v":0},null,null,null,"金額",{"$f":"IF(T96,IFERROR(SUM(U98:U101),\"\"),\"\")","v":""}]
[]
[null,"hide","hide","hide","hide","hide","hide"]
["hide",null,"最終値","選択値","記号","計算用","デフォルト値"]
["hide"]
["hide"]
["hide"]
["hide",null,null,null,null,null,null,{"$f":"COUNTIF(H102:H127,\"✔\")=11","v":false}]
["hide"]
["hide"]
["hide"]
["hide"]
["hide"]
["hide"]
["hide"]
["hide"]
["hide"]
["hide"]
["hide"]
["hide"]
["hide"]
["hide"]
["hide"]
["hide"]
["hide"]
["hide"]
["hide"]
["hide"]
["hide"]
["hide"]
["hide"]
["hide"]
["hide"]
["hide"]
["hide"]
["hide"]
["hide"]
["hide"]
["hide"]
["hide"]
["hide"]
["hide"]
["hide"]
["hide"]
["hide"]
["hide"]
["hide"]
["hide"]
["hide"]
["hide"]
["hide"]
["hide"]
["hide"]
["hide"]
["hide"]
["hide"]
["hide"]
["hide"]
["hide"]
["hide"]
["hide"]
["hide"]
["hide"]
["hide"]
["hide"]
["hide"]
["hide"]
["hide"]
["hide"]
["hide"]
["hide"]
["hide"]
["hide"]
["hide"]
["hide"]
["hide"]
["hide"]
["hide"]
["hide"]
["hide"]
["hide",null,null,null,null,null,null,null,null,null,1,"垂直","S",null,null,"重量"]
["hide",null,null,null,null,null,null,null,null,null,2,"テーパー","T",null,null,{"$f":"SUM(S87:S89)","v":{"$error":"#VALUE!"}}]
["hide"]
["hide"]
["hide",null,null,null,null,null,null,null,null,null,"サイズ記号","幅記号","形状内","形状外","形状左","形状右","ベース価格*1.5","左右カット価格","重量"]
["hide",null,null,null,null,null,null,null,"左",null,{"$f":"VLOOKUP(L87,C価格表!$B$11:$F$18,4,FALSE)","v":{"$error":"#N/A"}},{"$f":"MATCH(K98,C価格表!$C$12:$C$18,-1)","v":{"$error":"#N/A"}},{"$f":"VLOOKUP(O96,K82:M83,3,FALSE)","v":{"$error":"#N/A"}},{"$f":"VLOOKUP(R96,K82:M83,3,FALSE)","v":{"$error":"#N/A"}},{"$f":"IFERROR(IF(OR($D$102=4,$D$102=2),\"C\",VLOOKUP(P96,K82:M83,3,FALSE)),\"\")","v":""},{"$f":"IFERROR(IF($D$102=2,VLOOKUP($P$96,$K$82:$M$83,3,FALSE),\"C\"),\"\")","v":"C"},{"$f":"VLOOKUP(L87&$L$96,C価格表!I:M,5,FALSE)*1.5","v":{"$error":"#N/A"}},{"$f":"IF(O87=\"C\",20000,15000)","v":15000},{"$f":"(K98*L98-IF(O87=\"C\",MIN(K98:L98)^2/2,0)-IF(P87=\"C\",MIN(K98:L98)^2/2,0))*30*0.7/10/10/10/1000*S98","v":{"$error":"#VALUE!"}}]
["hide",null,null,null,null,null,null,null,"下",null,{"$f":"VLOOKUP(L88,C価格表!$B$11:$F$18,4,FALSE)","v":{"$error":"#N/A"}},{"$f":"MATCH(K99,C価格表!$C$12:$C$18,-1)","v":{"$error":"#N/A"}},{"$f":"M87","v":{"$error":"#N/A"}},{"$f":"N87","v":{"$error":"#N/A"}},{"$f":"IFERROR(IF($D$102=2,VLOOKUP($Q$96,$K$82:$M$83,3,FALSE),\"C\"),\"\")","v":"C"},{"$f":"IFERROR(IF($D$102=1,VLOOKUP($Q$96,$K$82:$M$83,3,FALSE),\"C\"),\"\")","v":"C"},{"$f":"VLOOKUP(L88&$L$96,C価格表!I:M,5,FALSE)*1.5","v":{"$error":"#N/A"}},{"$f":"IF(P88=\"C\",20000,15000)","v":20000},{"$f":"(K99*L99-IF(O88=\"C\",MIN(K99:L99)^2/2,0)-IF(P88=\"C\",MIN(K99:L99)^2/2,0))*30*0.7/10/10/10/1000*S99","v":{"$error":"#VALUE!"}}]
["hide",null,null,null,null,null,null,null,"右",null,{"$f":"VLOOKUP(L89,C価格表!$B$11:$F$18,4,FALSE)","v":{"$error":"#N/A"}},{"$f":"MATCH(K100,C価格表!$C$12:$C$18,-1)","v":{"$error":"#N/A"}},{"$f":"M88","v":{"$error":"#N/A"}},{"$f":"N88","v":{"$error":"#N/A"}},"C",{"$f":"IFERROR(IF(D102=3,VLOOKUP($R$96,K82:M83,3,FALSE),\"\"),\"\")","v":""},{"$f":"VLOOKUP(L89&$L$96,C価格表!I:M,5,FALSE)*1.5","v":{"$error":"#N/A"}},{"$f":"IF(P89=\"C\",20000,15000)","v":15000},{"$f":"(K100*L100-IF(O89=\"C\",MIN(K100:L100)^2/2,0)-IF(P89=\"C\",MIN(K100:L100)^2/2,0))*30*0.7/10/10/10/1000*S100","v":{"$error":"#VALUE!"}}]
["hide"]
["hide"]
["hide"]
["hide",null,null,null,null,null,null,null,null,null,null,null,null,null,null,null,"右"]
["hide",null,null,null,null,null,null,null,null,null,null,null,null,null,"内","左",{"$f":"IF(AND(Q96=\"C\",R96=\"C\"),20000,IF(OR(Q96=\"C\",R96=\"C\"),15000,0))","v":0},"外側"]
["hide",null,null,null,null,null,null,null,null,null,"奥行サイズ記号","奥行価格用記号","奥行","色","①","②","③","④",null,"表示"]
["hide",null,null,null,null,null,null,null,null,null,{"$f":"VLOOKUP(L96,C価格表!$B$11:$F$18,5,FALSE)","v":0},{"$f":"MATCH(M96,C価格表!D12:D17,-1)","v":6},{"$f":"K112","v":0},{"$f":"C127","v":0},0,0,0,0,0,false]
["hide",null,null,null,null,null,null,null,null,null,"幅長","奥行","形状","色","品番","特","品名","備考","数量","価格"]
["hide",null,null,null,null,null,null,null,"左",null,{"$f":"IF(レイアウトNo=3,K118,K122)","v":""},{"$f":"M96","v":0},{"$f":"M87&N87&O87&P87","v":{"$error":"#N/A"}},{"$f":"IF(N96=\"NO\",\"ナチュラルオーク\",\"ダークオーク\")","v":"ダークオーク"},{"$f":"\"AC\"&K87&$K$96&M98&$N$96&\"0Z\"","v":{"$error":"#N/A"}},{"$f":"IF(N92=\"N\",\"\",\"●\")","v":"●"},{"$f":"IF(レイアウトNo=3,\"組合せコの字カウンター\",IF(レイアウトNo=4,\"組合せロの字カウンター\",\"組合せL字カウンター\"))","v":"組合せL字カウンター"},null,{"$f":"IF(レイアウトNo=4,2,1)","v":1},{"$f":"SUM(Q87:R87)","v":{"$error":"#N/A"}},{"$f":"S98*T98","v":{"$error":"#N/A"}}]
["hide",null,null,null,null,null,null,null,"下",null,{"$f":"K116","v":""},{"$f":"L98","v":0},{"$f":"M88&N88&O88&P88","v":{"$error":"#N/A"}},{"$f":"N98","v":"ダークオーク"},{"$f":"\"AC\"&K88&$K$96&M99&$N$96&\"0Z\"","v":{"$error":"#N/A"}},{"$f":"IF(N93=\"N\",\"\",\"●\")","v":"●"},{"$f":"Q98","v":"組合せL字カウンター"},null,{"$f":"IF(レイアウトNo=4,2,1)","v":1},{"$f":"SUM(Q88:R88)","v":{"$error":"#N/A"}},{"$f":"S99*T99","v":{"$error":"#N/A"}}]
["hide",null,null,null,null,null,null,null,"右",null,{"$f":"K120","v":""},{"$f":"L99","v":0},{"$error":"#N/A"},{"$f":"N99","v":"ダークオーク"},{"$f":"\"AC\"&K89&$K$96&M100&$N$96&\"0Z\"","v":{"$error":"#N/A"}},{"$f":"IF(N94=\"N\",\"\",\"●\")","v":"●"},{"$f":"Q99","v":"組合せL字カウンター"},null,{"$f":"IF($D$102=3,1,0)","v":0},{"$f":"SUM(Q89:R89)","v":{"$error":"#N/A"}},{"$f":"IFERROR(S100*T100,0)","v":0}]
["hide"]
[null,null,null,0,null,null,null,{"$f":"IF(D102=0,\"\",\"✔\")","v":""},"レイアウト"]
[null,null,null,null,null,null,null,null,null,null,"数値を入力",null,"木口形状を選択"]
[null,null,null,null,null,null,null,null,"図記号",null,"サイズ mm","max.","木口選択"]
[]
[null,null,null,null,null,null,null,{"$f":"IF(OR(O96=0,K106=0),\"\",IF(K106>L106,\"\",\"✔\"))","v":""},"①",null,null,{"$f":"IF(レイアウトNo=3,2300-K112*3,2300-IF($O$88=\"C\",K112)-IF($P$88=\"C\",K112))","v":2300}]
[]
[null,null,null,null,{"$f":"K116-IF($D$102=3,2,1)*K112","v":{"$error":"#VALUE!"}},null,null,{"$f":"IF(OR(K108=0,O96=0),\"\",IF(K108>L108,\"\",\"✔\"))","v":""},"②",null,null,{"$f":"2300-IF(O87=\"C\",K112)-IF(P87=\"C\",K112)","v":2300},{"$f":"IFERROR(VLOOKUP($O$96,$K$82:$M$83,2,FALSE),\"\")","v":""}]
[]
[null,null,null,null,{"$f":"K118-IF($D$102=3,2,1)*K112","v":{"$error":"#VALUE!"}},null,null,{"$f":"IF(レイアウトNo<>3,\"✔\",IF(OR(K110=0,O96=0),\"\",\"✔\"))","v":"✔"},"③",null,null,{"$f":"2300-IF($O$89=\"C\",K112)-IF($P$89=\"C\",K112)","v":2300},{"$f":"IFERROR(VLOOKUP($O$96,$K$82:$M$83,2,FALSE),\"\")","v":""}]
[null,null,null,null,null,null,null,{"$f":"IF(OR(C111=0,E111=0,L111=0),\"\",\"✔\")","v":""}]
[null,null,null,null,{"$f":"K108+IF($D$102=3,2,1)*K112","v":0},null,null,{"$f":"IF(レイアウトNo=4,IF(K112=0,\"\",IF(K112>L112,\"\",\"✔\")),IF(OR(K112=0,P96=0),\"\",IF(K112>L112,\"\",\"✔\")))","v":""},{"$f":"IF(レイアウトNo=3,\"④\",\"③\")","v":"③"},null,null,{"$f":"IF(レイアウトNo<=2,2300-MAX(K106,K108),MIN(1100,IF(AND(O88=\"C\",P88=\"C\"),(2300-K106)/2,IF(OR(O88=\"C\",P88=\"C\"),2300-K106,1100)),M112,M112))","v":2300}]
[]
[null,null,null,null,{"$f":"K112","v":0},null,1100,{"$f":"IF(レイアウトNo=4,H112,IF(OR(K112=0,Q96=0),\"\",IF(K112>L112,\"\",IF(K114=\"最大値エラー\",\"\",\"✔\"))))","v":""},{"$f":"IF(レイアウトNo=3,\"⑤\",\"④\")","v":"④"},null,{"$f":"IF(E114>L114,\"最大値エラー\",IF(E114=0,\"\",E114))","v":""},{"$f":"IF(レイアウトNo<=2,2300-MAX(K106,K108),MIN(1100,IF(AND(O88=\"C\",P88=\"C\"),(2300-K106)/2,IF(OR(O88=\"C\",P88=\"C\"),2300-K106,1100)),M114))","v":2300}]
[]
[null,null,null,null,{"$f":"K106+IF(レイアウトNo<3,1,2)*K112","v":0},null,2300,{"$f":"IF(OR(K106=0,$R$96=0,K116=\"最大値エラー\"),\"\",IF(K116>L116,\"\",\"✔\"))","v":""},{"$f":"IF(レイアウトNo=3,\"⑥\",\"⑤\")","v":"⑤"},null,{"$f":"IF(E116>G116,\"最大値エラー\",IF(E116=0,\"\",E116))","v":""},2300]
[]
[null,null,null,null,{"$f":"K108+IF($D$102=3,1,2)*K112","v":0},null,2300,{"$f":"IF(レイアウトNo<3,\"✔\",IF(OR(K108=0,K118=\"最大値エラー\",$R$96=0),\"\",IF(K118>L118,\"\",\"✔\")))","v":"✔"},{"$f":"IF(レイアウトNo=3,\"⑦\",\"⑥\")","v":"⑥"},null,{"$f":"IF(E118>G118,\"最大値エラー\",IF(E118=0,\"\",E118))","v":""},2300,{"$f":"IFERROR(VLOOKUP($R$96,$K$82:$M$83,2,FALSE),\"\")","v":""}]
[]
[null,null,null,null,{"$f":"IF(レイアウトNo=4,E116,K110+IF($D$102=3,1,2)*K112)","v":0},null,2300,{"$f":"IF(K120=\"最大値エラー\",\"\",IF(レイアウトNo<3,\"✔\",IF(レイアウトNo=4,IF(AND(K106<>0,R96>0),\"✔\",\"\"),IF(AND(K110<>0,$R$96>0),\"✔\",\"\"))))","v":"✔"},{"$f":"IF(レイアウトNo=3,\"⑧\",\"⑦\")","v":"⑦"},null,{"$f":"IF(E120>G120,\"最大値エラー\",IF(E120=0,\"\",E120))","v":""},2300,{"$f":"IFERROR(VLOOKUP($R$96,$K$82:$M$83,2,FALSE),\"\")","v":""}]
[]
[null,null,null,null,{"$f":"K108+K112*IF(レイアウトNo=4,2,1)","v":0},null,2300,{"$f":"IF(レイアウトNo=3,\"✔\",IF(OR(K108=0,K122=\"最大値エラー\",$R$96=0),\"\",\"✔\"))","v":""},{"$f":"IF(レイアウトNo>2,\"⑧\",\"⑥\")","v":"⑥"},null,{"$f":"IF(E122>G122,\"最大値エラー\",IF(E122=0,\"\",E122))","v":""},2300,{"$f":"IFERROR(VLOOKUP($R$96,$K$82:$M$83,2,FALSE),\"\")","v":""}]
[]
[null,null,null,null,null,null,null,"※　⑤を基準としたい場合は、⑤=①＋③　ですので、①か③で調整"]
["hide"]
["hide",null,null,null,null,null,null,null,null,null,"NO","DO"]
[null,"色",{"$f":"D127","v":0},null,null,null,2,{"$f":"IF(C127=0,\"\",\"✔\")","v":""},"色 柄",null,"ナチュラル オーク","ダーク オーク"]

{"sheet":"一体コーナー","index":4,"n_rows":26,"n_cols":32,"rows_kept":26,"cut":false,"hidden":false,"merged":[[25,4,25,5],[4,1,4,2],[4,23,4,24],[6,1,8,2],[11,16,11,18],[20,8,21,9]]}
[null,"　一体型　コーナーカウンター　",null,null,null,null,null,null,null,null,null,null,null,null,null,"✔数",{"$f":"COUNTIF(A11:A27,\"✔\")","v":0}]
[null,null,null,null,null,null,null,null,null,null,null,null,null,null,null,null,"標準サイズ",{"$f":"VLOOKUP(INT(LEFT(Q3,1)),C価格表!B11:C18,2,FALSE)","v":0},{"$f":"VLOOKUP(INT(RIGHT(Q3,1)),C価格表!B11:D18,3,FALSE)","v":0}]
[null,null,null,null,null,null,null,null,null,null,null,null,null,null,null,null,{"$f":"MATCH(R8,C価格表!C12:C19,-1)&MATCH(MAX(Q10:S10),C価格表!D12:D18,-1)","v":"76"},{"$f":"VLOOKUP(INT(LEFT(Q3,1)),C価格表!$B$11:$F$18,4,FALSE)","v":0},{"$f":"VLOOKUP(INT(RIGHT(Q3,1)),C価格表!$B$11:$F$18,5,FALSE)","v":0},null,{"$f":"A25","v":0}]
[]
[null,"金額",null,null,null,null,null,null,null,null,null,null,null,null,null,null,"No","幅長","奥行","形状","色","品番","特","特注size",null,"数量","単価","金額","単価","数量","金額","メモ"]
[null,null,null,null,null,null,null,null,null,null,null,null,null,null,null,null,1,{"$f":"D18","v":0},{"$f":"MAX(D15,D19,D20)","v":0},{"$f":"\"一体\"&T8&U8&V8&W8","v":"一体SSSS"},{"$f":"IF(A25=\"NO\",\"ナチュラルオーク\",\"ダークオーク\")","v":"ダークオーク"},{"$f":"\"AH\"&R3&S3&T8&V8&U8&W8&U3&\"0Z\"","v":"AH00SSSS00Z"},{"$f":"TEXT(D18,\"0000-\")&TEXT(D15,\"0000-\")&TEXT(D16,\"0000-\")&TEXT(D19,\"0000-\")&TEXT(D17,\"0000-\")&TEXT(D20,\"0000-\")&TEXT(D21,\"0000-\")&TEXT(D22,\"0000-\")&A25&\"-\"&T8&U8&V8&W8","v":"0000-0000-0000-0000-0000-0000-0000-0000--SSSS"},{"$f":"IF(W11=3,\"一体型コの字カウンター\",\"一体型L字カウンター\")","v":"一体型コの字カウンター"},null,1,{"$f":"VLOOKUP(Q3,C価格表!I:N,6,FALSE)","v":{"$error":"#N/A"}}]
[null,"レイアウト",null,null,null,null,null,null,null,null,null,null,null,null,null,"②","５WL","１WC","６WR","形状内側","形状外側","形状左","形状右",null,"色"]
[null,null,null,null,null,null,null,null,null,null,null,null,null,null,null,{"$f":"IF(W11=2,0,D13)","v":0},{"$f":"IF(W11=2,0,IF(P8=0,0,D16))","v":0},{"$f":"Q12-Q8-S8","v":0},{"$f":"IF(W11=1,0,IF(P10=0,0,D17))","v":0},"S",{"$f":"IFERROR(VLOOKUP(F18,T16:V18,3,FALSE),\"S\")","v":"S"},{"$f":"IFERROR(VLOOKUP(F16,T16:V18,3,FALSE),\"S\")","v":"S"},{"$f":"IFERROR(VLOOKUP(F17,T16:V18,3,FALSE),\"S\")","v":"S"},null,{"$f":"A25","v":0}]
[null,null,null,null,null,null,null,null,null,null,null,null,null,null,null,"③","８DL","４DC","９DR","~1100"]
[null,null,null,"数値を入力",null,"木口形状を選択",null,null,null,null,null,null,null,null,null,{"$f":"IF(W11=1,0,D14)","v":0},{"$f":"D19","v":0},{"$f":"D15","v":0},{"$f":"D20","v":0},null,"重量",null,"形状"]
[null,"記号",null,"サイズ　mm","max.","木口選択",null,null,null,null,null,null,null,null,null,null,null,"７WT","~2300",null,{"$f":"(Q8*Q10+R10*(Q12-Q8-S8)+S8*S10)*30*0.7/10/10/10/1000","v":0},null,3]
[{"$f":"IF(D12=0,\"\",IF(D12>E12,\"\",\"✔\"))","v":""},"①","内幅",null,{"$f":"IF(W11=1,2300-D16,IF(W11=2,2300-D17,2300-D16-D17))","v":2300}," 垂直",null,null,null,null,null,null,null,null,null,null,{"$f":"D18","v":0}]
[{"$f":"IF(W11=2,\"✔\",IF(P8=0,\"\",IF(D13>E13,\"\",\"✔\")))","v":""},"②","左内奥行",null,{"$f":"1100-D15","v":1100},{"$f":"IF(F12=0,\"\",F12)","v":" 垂直"},null,null,null,null,null,null,null,null,null,null,"RL",null,"RR","~1100"]
[{"$f":"IF(W11=1,\"✔\",IF(P10=0,\"\",IF(D14>E14,\"\",\"✔\")))","v":""},"③","右内奥行",null,{"$f":"1100-D15","v":1100}," 垂直",null,null,null,null,null,null,null,null,null,null,{"$f":"D21","v":0},null,{"$f":"D22","v":0}]
[{"$f":"IF(D15=0,\"\",IF(D15>E15,\"\",\"✔\"))","v":""},"④","前奥行",null,{"$f":"1100-MAX(P8,P10)","v":1100}]
[{"$f":"IF(OR(D16=\"\",F16=\"\"),\"\",IF(D16>E16,\"\",\"✔\"))","v":""},"⑤",{"$f":"IF(W11=2,\"左辺形状\",\"左幅\")","v":"左幅"},null,{"$f":"IF(W11=1,2300-D12,IF(W11=2,1100-D14,2300-D12-D17))","v":2300},null,null,null,null,null,null,null,null,null,null,null,null,null,null,1,"波形(耳付き)","W"]
[{"$f":"IF(OR(D17=\"\",F17=\"\"),\"\",IF(D17>E17,\"\",\"✔\"))","v":""},"⑥",{"$f":"IF(W11=1,\"右辺形状\",\"右幅\")","v":"右幅"},null,{"$f":"IF(W11=1,E15,IF(W11=2,2300-D12,2300-D12-D16))","v":2300},null,null,null,null,null,null,null,null,null,null,null,null,null,null,2,"テーパー","T"]
[{"$f":"IF(NOT(ISNUMBER(D18)),\"\",IF(OR(D18=0,F18=\"\"),\"\",\"✔\"))","v":""},"⑦","全幅",{"$f":"IF(D12+IF(P8=0,0,D16)+IF(P10=0,0,D17)>E18,\"最大値エラー\",D12+IF(P8=0,0,D16)+IF(P10=0,0,D17))","v":0},2300,null,null,null,null,null,null,null,null,null,null,null,null,null,null,3,"垂直","S"]
[{"$f":"IF(NOT(ISNUMBER(D19)),\"\",IF(OR(D19=0,F19=\"\"),\"\",\"✔\"))","v":""},"⑧","左奥行",{"$f":"IF(P8=0,D15,IF(P8+D15>E19,\"最大値エラー\",P8+D15))","v":0},1100,{"$f":"\" \"&IFERROR(VLOOKUP(F18,$T$16:$U$18,2,FALSE),\"\")","v":" "}]
[{"$f":"IF(NOT(ISNUMBER(D20)),\"\",IF(OR(D20=0,F20=\"\"),\"\",\"✔\"))","v":""},"⑨","右奥行",{"$f":"IF(P10=0,D15,IF(P10+D15>E20,\"最大値エラー\",P10+D15))","v":0},1100,{"$f":"F19","v":" "}]
[{"$f":"IF(F18=1,\"✔\",IF(D21=\"\",\"\",\"✔\"))","v":""},"RL","左角R",null,100]
[{"$f":"IF(F18=1,\"✔\",IF(D22=\"\",\"\",\"✔\"))","v":""},"RR","右角R",null,100]
[]
[]
[null,null,null,"NO","DO"]
[{"$f":"IF(A25=0,\"\",\"✔\")","v":""},"色 柄",null,"ナチュラル オーク","ダーク オーク"]

{"sheet":"LIST","index":5,"n_rows":48,"n_cols":17,"rows_kept":48,"cut":false,"hidden":false,"merged":[[2,1,2,3],[3,1,3,3],[3,9,3,12],[2,9,2,12],[4,9,4,12]]}
[null,"見積リスト",null,null,null,null,"お客様"]
[null,null,null,null,null,null,0.32]
[null,"受注日",null,null,{"$f":"TODAY()","v":"2025-10-09"},"納入場所",null,null,"〒"]
[null,"注文番号",null,null,null,"注文名",null,null,"住所"]
[null,"納  期",null,null,null,"金額合計",{"$f":"M9","v":0},null,"電話番号"]
[null,null,null,null,null,null,null,null,null,null,null,"上代金額"]
[]
[]
[null,null,null,null,null,null,null,null,null,null,{"$f":"SUM(K11:K1048576)","v":0},null,{"$f":"SUM(M11:M1048576)","v":0},"合計",{"$f":"SUM(O11:O1048576)","v":0}]
["選択","No","幅長","奥行","形状","色","品番","特","品名","備考（任意入力）","数量","定価","金額","単価","金額","メモ","図番"]
["□"]
["□"]
["□"]
["□"]
["□"]
["□"]
["□"]
["□"]
["□"]
["□"]
["□"]
["□"]
["□"]
["□"]
["□"]
["□"]
["□"]
["□"]
["□"]
["□"]
["□"]
["□"]
["□"]
["□"]
["□"]
["□"]
["□"]
["□"]
["□"]
["□"]
["□"]
["□"]
["□"]
["□"]
["□"]
["□"]
["□"]
["□"]

{"sheet":"図面LIST","index":6,"n_rows":10,"n_cols":3,"rows_kept":10,"cut":false,"hidden":false,"merged":[]}
[]
[null,"イメージ図 リスト"]
[null,"受注日",{"$f":"LIST!E3","v":"2025-10-09"}]
[null,"注文No",{"$f":"IF(LIST!E4=0,\"\",LIST!E4)","v":""}]
[null,"納期",{"$f":"IF(LIST!E5=0,\"\",LIST!E5)","v":""}]
[null,"納入場所",{"$f":"IF(LIST!G3=0,\"\",LIST!G3)","v":""}]
[null,"注文名",{"$f":"IF(LIST!G4=0,\"\",LIST!G4)","v":""}]
[null,"合計金額",{"$f":"LIST!G5","v":0}]
[]
[null,"図番"]

{"sheet":"csv","index":7,"n_rows":300,"n_cols":5,"rows_kept":300,"cut":false,"hidden":true,"merged":[]}
[{"$f":"LIST!$G$4","v":0}]
[{"$f":"LIST!$E$4","v":0}]
[{"$f":"IF(LIST!G6=\"\",\"\",LIST!G6)","v":""},{"$f":"IF(LIST!E6<>\"\",\"人口銘木AL［\"&LIST!E6 &\"] \"&LIST!F6,\"\")","v":""},{"$f":"IF(LIST!G6=\"\",\"\",LIST!K6)","v":""},{"$f":"IF(LIST!O6=\"\",\"\",LIST!O6)","v":""},{"$f":"IF(LIST!H6=\"\",\"\",IF(LIST!I6=0,\"H\"&LIST!J6,\"W\"&LIST!I6&IF(LIST!J6=0,\"\",\" H\"&LIST!J6)))","v":""}]
[{"$f":"IF(LIST!G7=\"\",\"\",LIST!G7)","v":""},{"$f":"IF(LIST!E7<>\"\",\"人口銘木AL［\"&LIST!E7 &\"] \"&LIST!F7,\"\")","v":""},{"$f":"IF(LIST!G7=\"\",\"\",LIST!K7)","v":""},{"$f":"IF(LIST!O7=\"\",\"\",LIST!O7)","v":""},{"$f":"IF(LIST!H7=\"\",\"\",IF(LIST!I7=0,\"H\"&LIST!J7,\"W\"&LIST!I7&IF(LIST!J7=0,\"\",\" H\"&LIST!J7)))","v":""}]
[{"$f":"IF(LIST!G8=\"\",\"\",LIST!G8)","v":""},{"$f":"IF(LIST!E8<>\"\",\"人口銘木AL［\"&LIST!E8 &\"] \"&LIST!F8,\"\")","v":""},{"$f":"IF(LIST!G8=\"\",\"\",LIST!K8)","v":""},{"$f":"IF(LIST!O8=\"\",\"\",LIST!O8)","v":""},{"$f":"IF(LIST!H8=\"\",\"\",IF(LIST!I8=0,\"H\"&LIST!J8,\"W\"&LIST!I8&IF(LIST!J8=0,\"\",\" H\"&LIST!J8)))","v":""}]
[{"$f":"IF(LIST!G9=\"\",\"\",LIST!G9)","v":""},{"$f":"IF(LIST!E9<>\"\",\"人口銘木AL［\"&LIST!E9 &\"] \"&LIST!F9,\"\")","v":""},{"$f":"IF(LIST!G9=\"\",\"\",LIST!K9)","v":""},null,{"$f":"IF(LIST!H9=\"\",\"\",IF(LIST!I9=0,\"H\"&LIST!J9,\"W\"&LIST!I9&IF(LIST!J9=0,\"\",\" H\"&LIST!J9)))","v":""}]
[{"$f":"IF(LIST!G10=\"\",\"\",LIST!G10)","v":"品番"},{"$f":"IF(LIST!E10<>\"\",\"人口銘木AL［\"&LIST!E10 &\"] \"&LIST!F10,\"\")","v":"人口銘木AL［形状] 色"},{"$f":"IF(LIST!G10=\"\",\"\",LIST!K10)","v":"数量"},{"$f":"IF(LIST!O10=\"\",\"\",LIST!O10)","v":"金額"},{"$f":"IF(LIST!H10=\"\",\"\",IF(LIST!I10=0,\"H\"&LIST!J10,\"W\"&LIST!I10&IF(LIST!J10=0,\"\",\" H\"&LIST!J10)))","v":"W品名 H備考（任意入力）"}]
[{"$f":"IF(LIST!G11=\"\",\"\",LIST!G11)","v":""},{"$f":"IF(LIST!E11<>\"\",\"人口銘木AL［\"&LIST!E11 &\"] \"&LIST!F11,\"\")","v":""},{"$f":"IF(LIST!G11=\"\",\"\",LIST!K11)","v":""},{"$f":"IF(LIST!O11=\"\",\"\",LIST!O11)","v":""},{"$f":"IF(LIST!H11=\"\",\"\",IF(LIST!I11=0,\"H\"&LIST!J11,\"W\"&LIST!I11&IF(LIST!J11=0,\"\",\" H\"&LIST!J11)))","v":""}]
[{"$f":"IF(LIST!G12=\"\",\"\",LIST!G12)","v":""},{"$f":"IF(LIST!E12<>\"\",\"人口銘木AL［\"&LIST!E12 &\"] \"&LIST!F12,\"\")","v":""},{"$f":"IF(LIST!G12=\"\",\"\",LIST!K12)","v":""},{"$f":"IF(LIST!O12=\"\",\"\",LIST!O12)","v":""},{"$f":"IF(LIST!H12=\"\",\"\",IF(LIST!I12=0,\"H\"&LIST!J12,\"W\"&LIST!I12&IF(LIST!J12=0,\"\",\" H\"&LIST!J12)))","v":""}]
[{"$f":"IF(LIST!G13=\"\",\"\",LIST!G13)","v":""},{"$f":"IF(LIST!E13<>\"\",\"人口銘木AL［\"&LIST!E13 &\"] \"&LIST!F13,\"\")","v":""},{"$f":"IF(LIST!G13=\"\",\"\",LIST!K13)","v":""},{"$f":"IF(LIST!O13=\"\",\"\",LIST!O13)","v":""},{"$f":"IF(LIST!H13=\"\",\"\",IF(LIST!I13=0,\"H\"&LIST!J13,\"W\"&LIST!I13&IF(LIST!J13=0,\"\",\" H\"&LIST!J13)))","v":""}]
[{"$f":"IF(LIST!G14=\"\",\"\",LIST!G14)","v":""},{"$f":"IF(LIST!E14<>\"\",\"人口銘木AL［\"&LIST!E14 &\"] \"&LIST!F14,\"\")","v":""},{"$f":"IF(LIST!G14=\"\",\"\",LIST!K14)","v":""},{"$f":"IF(LIST!O14=\"\",\"\",LIST!O14)","v":""},{"$f":"IF(LIST!H14=\"\",\"\",IF(LIST!I14=0,\"H\"&LIST!J14,\"W\"&LIST!I14&IF(LIST!J14=0,\"\",\" H\"&LIST!J14)))","v":""}]
[{"$f":"IF(LIST!G15=\"\",\"\",LIST!G15)","v":""},{"$f":"IF(LIST!E15<>\"\",\"人口銘木AL［\"&LIST!E15 &\"] \"&LIST!F15,\"\")","v":""},{"$f":"IF(LIST!G15=\"\",\"\",LIST!K15)","v":""},{"$f":"IF(LIST!O15=\"\",\"\",LIST!O15)","v":""},{"$f":"IF(LIST!H15=\"\",\"\",IF(LIST!I15=0,\"H\"&LIST!J15,\"W\"&LIST!I15&IF(LIST!J15=0,\"\",\" H\"&LIST!J15)))","v":""}]
[{"$f":"IF(LIST!G16=\"\",\"\",LIST!G16)","v":""},{"$f":"IF(LIST!E16<>\"\",\"人口銘木AL［\"&LIST!E16 &\"] \"&LIST!F16,\"\")","v":""},{"$f":"IF(LIST!G16=\"\",\"\",LIST!K16)","v":""},{"$f":"IF(LIST!O16=\"\",\"\",LIST!O16)","v":""},{"$f":"IF(LIST!H16=\"\",\"\",IF(LIST!I16=0,\"H\"&LIST!J16,\"W\"&LIST!I16&IF(LIST!J16=0,\"\",\" H\"&LIST!J16)))","v":""}]
[{"$f":"IF(LIST!G17=\"\",\"\",LIST!G17)","v":""},{"$f":"IF(LIST!E17<>\"\",\"人口銘木AL［\"&LIST!E17 &\"] \"&LIST!F17,\"\")","v":""},{"$f":"IF(LIST!G17=\"\",\"\",LIST!K17)","v":""},{"$f":"IF(LIST!O17=\"\",\"\",LIST!O17)","v":""},{"$f":"IF(LIST!H17=\"\",\"\",IF(LIST!I17=0,\"H\"&LIST!J17,\"W\"&LIST!I17&IF(LIST!J17=0,\"\",\" H\"&LIST!J17)))","v":""}]
[{"$f":"IF(LIST!G18=\"\",\"\",LIST!G18)","v":""},{"$f":"IF(LIST!E18<>\"\",\"人口銘木AL［\"&LIST!E18 &\"] \"&LIST!F18,\"\")","v":""},{"$f":"IF(LIST!G18=\"\",\"\",LIST!K18)","v":""},{"$f":"IF(LIST!O18=\"\",\"\",LIST!O18)","v":""},{"$f":"IF(LIST!H18=\"\",\"\",IF(LIST!I18=0,\"H\"&LIST!J18,\"W\"&LIST!I18&IF(LIST!J18=0,\"\",\" H\"&LIST!J18)))","v":""}]
[{"$f":"IF(LIST!G19=\"\",\"\",LIST!G19)","v":""},{"$f":"IF(LIST!E19<>\"\",\"人口銘木AL［\"&LIST!E19 &\"] \"&LIST!F19,\"\")","v":""},{"$f":"IF(LIST!G19=\"\",\"\",LIST!K19)","v":""},{"$f":"IF(LIST!O19=\"\",\"\",LIST!O19)","v":""},{"$f":"IF(LIST!H19=\"\",\"\",IF(LIST!I19=0,\"H\"&LIST!J19,\"W\"&LIST!I19&IF(LIST!J19=0,\"\",\" H\"&LIST!J19)))","v":""}]
[{"$f":"IF(LIST!G20=\"\",\"\",LIST!G20)","v":""},{"$f":"IF(LIST!E20<>\"\",\"人口銘木AL［\"&LIST!E20 &\"] \"&LIST!F20,\"\")","v":""},{"$f":"IF(LIST!G20=\"\",\"\",LIST!K20)","v":""},{"$f":"IF(LIST!O20=\"\",\"\",LIST!O20)","v":""},{"$f":"IF(LIST!H20=\"\",\"\",IF(LIST!I20=0,\"H\"&LIST!J20,\"W\"&LIST!I20&IF(LIST!J20=0,\"\",\" H\"&LIST!J20)))","v":""}]
[{"$f":"IF(LIST!G21=\"\",\"\",LIST!G21)","v":""},{"$f":"IF(LIST!E21<>\"\",\"人口銘木AL［\"&LIST!E21 &\"] \"&LIST!F21,\"\")","v":""},{"$f":"IF(LIST!G21=\"\",\"\",LIST!K21)","v":""},{"$f":"IF(LIST!O21=\"\",\"\",LIST!O21)","v":""},{"$f":"IF(LIST!H21=\"\",\"\",IF(LIST!I21=0,\"H\"&LIST!J21,\"W\"&LIST!I21&IF(LIST!J21=0,\"\",\" H\"&LIST!J21)))","v":""}]
[{"$f":"IF(LIST!G22=\"\",\"\",LIST!G22)","v":""},{"$f":"IF(LIST!E22<>\"\",\"人口銘木AL［\"&LIST!E22 &\"] \"&LIST!F22,\"\")","v":""},{"$f":"IF(LIST!G22=\"\",\"\",LIST!K22)","v":""},{"$f":"IF(LIST!O22=\"\",\"\",LIST!O22)","v":""},{"$f":"IF(LIST!H22=\"\",\"\",IF(LIST!I22=0,\"H\"&LIST!J22,\"W\"&LIST!I22&IF(LIST!J22=0,\"\",\" H\"&LIST!J22)))","v":""}]
[{"$f":"IF(LIST!G23=\"\",\"\",LIST!G23)","v":""},{"$f":"IF(LIST!E23<>\"\",\"人口銘木AL［\"&LIST!E23 &\"] \"&LIST!F23,\"\")","v":""},{"$f":"IF(LIST!G23=\"\",\"\",LIST!K23)","v":""},{"$f":"IF(LIST!O23=\"\",\"\",LIST!O23)","v":""},{"$f":"IF(LIST!H23=\"\",\"\",IF(LIST!I23=0,\"H\"&LIST!J23,\"W\"&LIST!I23&IF(LIST!J23=0,\"\",\" H\"&LIST!J23)))","v":""}]
[{"$f":"IF(LIST!G24=\"\",\"\",LIST!G24)","v":""},{"$f":"IF(LIST!E24<>\"\",\"人口銘木AL［\"&LIST!E24 &\"] \"&LIST!F24,\"\")","v":""},{"$f":"IF(LIST!G24=\"\",\"\",LIST!K24)","v":""},{"$f":"IF(LIST!O24=\"\",\"\",LIST!O24)","v":""},{"$f":"IF(LIST!H24=\"\",\"\",IF(LIST!I24=0,\"H\"&LIST!J24,\"W\"&LIST!I24&IF(LIST!J24=0,\"\",\" H\"&LIST!J24)))","v":""}]
[{"$f":"IF(LIST!G25=\"\",\"\",LIST!G25)","v":""},{"$f":"IF(LIST!E25<>\"\",\"人口銘木AL［\"&LIST!E25 &\"] \"&LIST!F25,\"\")","v":""},{"$f":"IF(LIST!G25=\"\",\"\",LIST!K25)","v":""},{"$f":"IF(LIST!O25=\"\",\"\",LIST!O25)","v":""},{"$f":"IF(LIST!H25=\"\",\"\",IF(LIST!I25=0,\"H\"&LIST!J25,\"W\"&LIST!I25&IF(LIST!J25=0,\"\",\" H\"&LIST!J25)))","v":""}]
[{"$f":"IF(LIST!G26=\"\",\"\",LIST!G26)","v":""},{"$f":"IF(LIST!E26<>\"\",\"人口銘木AL［\"&LIST!E26 &\"] \"&LIST!F26,\"\")","v":""},{"$f":"IF(LIST!G26=\"\",\"\",LIST!K26)","v":""},{"$f":"IF(LIST!O26=\"\",\"\",LIST!O26)","v":""},{"$f":"IF(LIST!H26=\"\",\"\",IF(LIST!I26=0,\"H\"&LIST!J26,\"W\"&LIST!I26&IF(LIST!J26=0,\"\",\" H\"&LIST!J26)))","v":""}]
[{"$f":"IF(LIST!G27=\"\",\"\",LIST!G27)","v":""},{"$f":"IF(LIST!E27<>\"\",\"人口銘木AL［\"&LIST!E27 &\"] \"&LIST!F27,\"\")","v":""},{"$f":"IF(LIST!G27=\"\",\"\",LIST!K27)","v":""},{"$f":"IF(LIST!O27=\"\",\"\",LIST!O27)","v":""},{"$f":"IF(LIST!H27=\"\",\"\",IF(LIST!I27=0,\"H\"&LIST!J27,\"W\"&LIST!I27&IF(LIST!J27=0,\"\",\" H\"&LIST!J27)))","v":""}]
[{"$f":"IF(LIST!G28=\"\",\"\",LIST!G28)","v":""},{"$f":"IF(LIST!E28<>\"\",\"人口銘木AL［\"&LIST!E28 &\"] \"&LIST!F28,\"\")","v":""},{"$f":"IF(LIST!G28=\"\",\"\",LIST!K28)","v":""},{"$f":"IF(LIST!O28=\"\",\"\",LIST!O28)","v":""},{"$f":"IF(LIST!H28=\"\",\"\",IF(LIST!I28=0,\"H\"&LIST!J28,\"W\"&LIST!I28&IF(LIST!J28=0,\"\",\" H\"&LIST!J28)))","v":""}]
[{"$f":"IF(LIST!G29=\"\",\"\",LIST!G29)","v":""},{"$f":"IF(LIST!E29<>\"\",\"人口銘木AL［\"&LIST!E29 &\"] \"&LIST!F29,\"\")","v":""},{"$f":"IF(LIST!G29=\"\",\"\",LIST!K29)","v":""},{"$f":"IF(LIST!O29=\"\",\"\",LIST!O29)","v":""},{"$f":"IF(LIST!H29=\"\",\"\",IF(LIST!I29=0,\"H\"&LIST!J29,\"W\"&LIST!I29&IF(LIST!J29=0,\"\",\" H\"&LIST!J29)))","v":""}]
[{"$f":"IF(LIST!G30=\"\",\"\",LIST!G30)","v":""},{"$f":"IF(LIST!E30<>\"\",\"人口銘木AL［\"&LIST!E30 &\"] \"&LIST!F30,\"\")","v":""},{"$f":"IF(LIST!G30=\"\",\"\",LIST!K30)","v":""},{"$f":"IF(LIST!O30=\"\",\"\",LIST!O30)","v":""},{"$f":"IF(LIST!H30=\"\",\"\",IF(LIST!I30=0,\"H\"&LIST!J30,\"W\"&LIST!I30&IF(LIST!J30=0,\"\",\" H\"&LIST!J30)))","v":""}]
[{"$f":"IF(LIST!G31=\"\",\"\",LIST!G31)","v":""},{"$f":"IF(LIST!E31<>\"\",\"人口銘木AL［\"&LIST!E31 &\"] \"&LIST!F31,\"\")","v":""},{"$f":"IF(LIST!G31=\"\",\"\",LIST!K31)","v":""},{"$f":"IF(LIST!O31=\"\",\"\",LIST!O31)","v":""},{"$f":"IF(LIST!H31=\"\",\"\",IF(LIST!I31=0,\"H\"&LIST!J31,\"W\"&LIST!I31&IF(LIST!J31=0,\"\",\" H\"&LIST!J31)))","v":""}]
[{"$f":"IF(LIST!G32=\"\",\"\",LIST!G32)","v":""},{"$f":"IF(LIST!E32<>\"\",\"人口銘木AL［\"&LIST!E32 &\"] \"&LIST!F32,\"\")","v":""},{"$f":"IF(LIST!G32=\"\",\"\",LIST!K32)","v":""},{"$f":"IF(LIST!O32=\"\",\"\",LIST!O32)","v":""},{"$f":"IF(LIST!H32=\"\",\"\",IF(LIST!I32=0,\"H\"&LIST!J32,\"W\"&LIST!I32&IF(LIST!J32=0,\"\",\" H\"&LIST!J32)))","v":""}]
[{"$f":"IF(LIST!G33=\"\",\"\",LIST!G33)","v":""},{"$f":"IF(LIST!E33<>\"\",\"人口銘木AL［\"&LIST!E33 &\"] \"&LIST!F33,\"\")","v":""},{"$f":"IF(LIST!G33=\"\",\"\",LIST!K33)","v":""},{"$f":"IF(LIST!O33=\"\",\"\",LIST!O33)","v":""},{"$f":"IF(LIST!H33=\"\",\"\",IF(LIST!I33=0,\"H\"&LIST!J33,\"W\"&LIST!I33&IF(LIST!J33=0,\"\",\" H\"&LIST!J33)))","v":""}]
[{"$f":"IF(LIST!G34=\"\",\"\",LIST!G34)","v":""},{"$f":"IF(LIST!E34<>\"\",\"人口銘木AL［\"&LIST!E34 &\"] \"&LIST!F34,\"\")","v":""},{"$f":"IF(LIST!G34=\"\",\"\",LIST!K34)","v":""},{"$f":"IF(LIST!O34=\"\",\"\",LIST!O34)","v":""},{"$f":"IF(LIST!H34=\"\",\"\",IF(LIST!I34=0,\"H\"&LIST!J34,\"W\"&LIST!I34&IF(LIST!J34=0,\"\",\" H\"&LIST!J34)))","v":""}]
[{"$f":"IF(LIST!G35=\"\",\"\",LIST!G35)","v":""},{"$f":"IF(LIST!E35<>\"\",\"人口銘木AL［\"&LIST!E35 &\"] \"&LIST!F35,\"\")","v":""},{"$f":"IF(LIST!G35=\"\",\"\",LIST!K35)","v":""},{"$f":"IF(LIST!O35=\"\",\"\",LIST!O35)","v":""},{"$f":"IF(LIST!H35=\"\",\"\",IF(LIST!I35=0,\"H\"&LIST!J35,\"W\"&LIST!I35&IF(LIST!J35=0,\"\",\" H\"&LIST!J35)))","v":""}]
[{"$f":"IF(LIST!G36=\"\",\"\",LIST!G36)","v":""},{"$f":"IF(LIST!E36<>\"\",\"人口銘木AL［\"&LIST!E36 &\"] \"&LIST!F36,\"\")","v":""},{"$f":"IF(LIST!G36=\"\",\"\",LIST!K36)","v":""},{"$f":"IF(LIST!O36=\"\",\"\",LIST!O36)","v":""},{"$f":"IF(LIST!H36=\"\",\"\",IF(LIST!I36=0,\"H\"&LIST!J36,\"W\"&LIST!I36&IF(LIST!J36=0,\"\",\" H\"&LIST!J36)))","v":""}]
[{"$f":"IF(LIST!G37=\"\",\"\",LIST!G37)","v":""},{"$f":"IF(LIST!E37<>\"\",\"人口銘木AL［\"&LIST!E37 &\"] \"&LIST!F37,\"\")","v":""},{"$f":"IF(LIST!G37=\"\",\"\",LIST!K37)","v":""},{"$f":"IF(LIST!O37=\"\",\"\",LIST!O37)","v":""},{"$f":"IF(LIST!H37=\"\",\"\",IF(LIST!I37=0,\"H\"&LIST!J37,\"W\"&LIST!I37&IF(LIST!J37=0,\"\",\" H\"&LIST!J37)))","v":""}]
[{"$f":"IF(LIST!G38=\"\",\"\",LIST!G38)","v":""},{"$f":"IF(LIST!E38<>\"\",\"人口銘木AL［\"&LIST!E38 &\"] \"&LIST!F38,\"\")","v":""},{"$f":"IF(LIST!G38=\"\",\"\",LIST!K38)","v":""},{"$f":"IF(LIST!O38=\"\",\"\",LIST!O38)","v":""},{"$f":"IF(LIST!H38=\"\",\"\",IF(LIST!I38=0,\"H\"&LIST!J38,\"W\"&LIST!I38&IF(LIST!J38=0,\"\",\" H\"&LIST!J38)))","v":""}]
[{"$f":"IF(LIST!G39=\"\",\"\",LIST!G39)","v":""},{"$f":"IF(LIST!E39<>\"\",\"人口銘木AL［\"&LIST!E39 &\"] \"&LIST!F39,\"\")","v":""},{"$f":"IF(LIST!G39=\"\",\"\",LIST!K39)","v":""},{"$f":"IF(LIST!O39=\"\",\"\",LIST!O39)","v":""},{"$f":"IF(LIST!H39=\"\",\"\",IF(LIST!I39=0,\"H\"&LIST!J39,\"W\"&LIST!I39&IF(LIST!J39=0,\"\",\" H\"&LIST!J39)))","v":""}]
[{"$f":"IF(LIST!G40=\"\",\"\",LIST!G40)","v":""},{"$f":"IF(LIST!E40<>\"\",\"人口銘木AL［\"&LIST!E40 &\"] \"&LIST!F40,\"\")","v":""},{"$f":"IF(LIST!G40=\"\",\"\",LIST!K40)","v":""},{"$f":"IF(LIST!O40=\"\",\"\",LIST!O40)","v":""},{"$f":"IF(LIST!H40=\"\",\"\",IF(LIST!I40=0,\"H\"&LIST!J40,\"W\"&LIST!I40&IF(LIST!J40=0,\"\",\" H\"&LIST!J40)))","v":""}]
[{"$f":"IF(LIST!G41=\"\",\"\",LIST!G41)","v":""},{"$f":"IF(LIST!E41<>\"\",\"人口銘木AL［\"&LIST!E41 &\"] \"&LIST!F41,\"\")","v":""},{"$f":"IF(LIST!G41=\"\",\"\",LIST!K41)","v":""},{"$f":"IF(LIST!O41=\"\",\"\",LIST!O41)","v":""},{"$f":"IF(LIST!H41=\"\",\"\",IF(LIST!I41=0,\"H\"&LIST!J41,\"W\"&LIST!I41&IF(LIST!J41=0,\"\",\" H\"&LIST!J41)))","v":""}]
[{"$f":"IF(LIST!G42=\"\",\"\",LIST!G42)","v":""},{"$f":"IF(LIST!E42<>\"\",\"人口銘木AL［\"&LIST!E42 &\"] \"&LIST!F42,\"\")","v":""},{"$f":"IF(LIST!G42=\"\",\"\",LIST!K42)","v":""},{"$f":"IF(LIST!O42=\"\",\"\",LIST!O42)","v":""},{"$f":"IF(LIST!H42=\"\",\"\",IF(LIST!I42=0,\"H\"&LIST!J42,\"W\"&LIST!I42&IF(LIST!J42=0,\"\",\" H\"&LIST!J42)))","v":""}]
[{"$f":"IF(LIST!G43=\"\",\"\",LIST!G43)","v":""},{"$f":"IF(LIST!E43<>\"\",\"人口銘木AL［\"&LIST!E43 &\"] \"&LIST!F43,\"\")","v":""},{"$f":"IF(LIST!G43=\"\",\"\",LIST!K43)","v":""},{"$f":"IF(LIST!O43=\"\",\"\",LIST!O43)","v":""},{"$f":"IF(LIST!H43=\"\",\"\",IF(LIST!I43=0,\"H\"&LIST!J43,\"W\"&LIST!I43&IF(LIST!J43=0,\"\",\" H\"&LIST!J43)))","v":""}]
[{"$f":"IF(LIST!G44=\"\",\"\",LIST!G44)","v":""},{"$f":"IF(LIST!E44<>\"\",\"人口銘木AL［\"&LIST!E44 &\"] \"&LIST!F44,\"\")","v":""},{"$f":"IF(LIST!G44=\"\",\"\",LIST!K44)","v":""},{"$f":"IF(LIST!O44=\"\",\"\",LIST!O44)","v":""},{"$f":"IF(LIST!H44=\"\",\"\",IF(LIST!I44=0,\"H\"&LIST!J44,\"W\"&LIST!I44&IF(LIST!J44=0,\"\",\" H\"&LIST!J44)))","v":""}]
[{"$f":"IF(LIST!G45=\"\",\"\",LIST!G45)","v":""},{"$f":"IF(LIST!E45<>\"\",\"人口銘木AL［\"&LIST!E45 &\"] \"&LIST!F45,\"\")","v":""},{"$f":"IF(LIST!G45=\"\",\"\",LIST!K45)","v":""},{"$f":"IF(LIST!O45=\"\",\"\",LIST!O45)","v":""},{"$f":"IF(LIST!H45=\"\",\"\",IF(LIST!I45=0,\"H\"&LIST!J45,\"W\"&LIST!I45&IF(LIST!J45=0,\"\",\" H\"&LIST!J45)))","v":""}]
[{"$f":"IF(LIST!G46=\"\",\"\",LIST!G46)","v":""},{"$f":"IF(LIST!E46<>\"\",\"人口銘木AL［\"&LIST!E46 &\"] \"&LIST!F46,\"\")","v":""},{"$f":"IF(LIST!G46=\"\",\"\",LIST!K46)","v":""},{"$f":"IF(LIST!O46=\"\",\"\",LIST!O46)","v":""},{"$f":"IF(LIST!H46=\"\",\"\",IF(LIST!I46=0,\"H\"&LIST!J46,\"W\"&LIST!I46&IF(LIST!J46=0,\"\",\" H\"&LIST!J46)))","v":""}]
[{"$f":"IF(LIST!G47=\"\",\"\",LIST!G47)","v":""},{"$f":"IF(LIST!E47<>\"\",\"人口銘木AL［\"&LIST!E47 &\"] \"&LIST!F47,\"\")","v":""},{"$f":"IF(LIST!G47=\"\",\"\",LIST!K47)","v":""},{"$f":"IF(LIST!O47=\"\",\"\",LIST!O47)","v":""},{"$f":"IF(LIST!H47=\"\",\"\",IF(LIST!I47=0,\"H\"&LIST!J47,\"W\"&LIST!I47&IF(LIST!J47=0,\"\",\" H\"&LIST!J47)))","v":""}]
[{"$f":"IF(LIST!G48=\"\",\"\",LIST!G48)","v":""},{"$f":"IF(LIST!E48<>\"\",\"人口銘木AL［\"&LIST!E48 &\"] \"&LIST!F48,\"\")","v":""},{"$f":"IF(LIST!G48=\"\",\"\",LIST!K48)","v":""},{"$f":"IF(LIST!O48=\"\",\"\",LIST!O48)","v":""},{"$f":"IF(LIST!H48=\"\",\"\",IF(LIST!I48=0,\"H\"&LIST!J48,\"W\"&LIST!I48&IF(LIST!J48=0,\"\",\" H\"&LIST!J48)))","v":""}]
[{"$f":"IF(LIST!G49=\"\",\"\",LIST!G49)","v":""},{"$f":"IF(LIST!E49<>\"\",\"人口銘木AL［\"&LIST!E49 &\"] \"&LIST!F49,\"\")","v":""},{"$f":"IF(LIST!G49=\"\",\"\",LIST!K49)","v":""},{"$f":"IF(LIST!O49=\"\",\"\",LIST!O49)","v":""},{"$f":"IF(LIST!H49=\"\",\"\",IF(LIST!I49=0,\"H\"&LIST!J49,\"W\"&LIST!I49&IF(LIST!J49=0,\"\",\" H\"&LIST!J49)))","v":""}]
[{"$f":"IF(LIST!G50=\"\",\"\",LIST!G50)","v":""},{"$f":"IF(LIST!E50<>\"\",\"人口銘木AL［\"&LIST!E50 &\"] \"&LIST!F50,\"\")","v":""},{"$f":"IF(LIST!G50=\"\",\"\",LIST!K50)","v":""},{"$f":"IF(LIST!O50=\"\",\"\",LIST!O50)","v":""},{"$f":"IF(LIST!H50=\"\",\"\",IF(LIST!I50=0,\"H\"&LIST!J50,\"W\"&LIST!I50&IF(LIST!J50=0,\"\",\" H\"&LIST!J50)))","v":""}]
[{"$f":"IF(LIST!G51=\"\",\"\",LIST!G51)","v":""},{"$f":"IF(LIST!E51<>\"\",\"人口銘木AL［\"&LIST!E51 &\"] \"&LIST!F51,\"\")","v":""},{"$f":"IF(LIST!G51=\"\",\"\",LIST!K51)","v":""},{"$f":"IF(LIST!O51=\"\",\"\",LIST!O51)","v":""},{"$f":"IF(LIST!H51=\"\",\"\",IF(LIST!I51=0,\"H\"&LIST!J51,\"W\"&LIST!I51&IF(LIST!J51=0,\"\",\" H\"&LIST!J51)))","v":""}]
[{"$f":"IF(LIST!G52=\"\",\"\",LIST!G52)","v":""},{"$f":"IF(LIST!E52<>\"\",\"人口銘木AL［\"&LIST!E52 &\"] \"&LIST!F52,\"\")","v":""},{"$f":"IF(LIST!G52=\"\",\"\",LIST!K52)","v":""},{"$f":"IF(LIST!O52=\"\",\"\",LIST!O52)","v":""},{"$f":"IF(LIST!H52=\"\",\"\",IF(LIST!I52=0,\"H\"&LIST!J52,\"W\"&LIST!I52&IF(LIST!J52=0,\"\",\" H\"&LIST!J52)))","v":""}]
[{"$f":"IF(LIST!G53=\"\",\"\",LIST!G53)","v":""},{"$f":"IF(LIST!E53<>\"\",\"人口銘木AL［\"&LIST!E53 &\"] \"&LIST!F53,\"\")","v":""},{"$f":"IF(LIST!G53=\"\",\"\",LIST!K53)","v":""},{"$f":"IF(LIST!O53=\"\",\"\",LIST!O53)","v":""},{"$f":"IF(LIST!H53=\"\",\"\",IF(LIST!I53=0,\"H\"&LIST!J53,\"W\"&LIST!I53&IF(LIST!J53=0,\"\",\" H\"&LIST!J53)))","v":""}]
[{"$f":"IF(LIST!G54=\"\",\"\",LIST!G54)","v":""},{"$f":"IF(LIST!E54<>\"\",\"人口銘木AL［\"&LIST!E54 &\"] \"&LIST!F54,\"\")","v":""},{"$f":"IF(LIST!G54=\"\",\"\",LIST!K54)","v":""},{"$f":"IF(LIST!O54=\"\",\"\",LIST!O54)","v":""},{"$f":"IF(LIST!H54=\"\",\"\",IF(LIST!I54=0,\"H\"&LIST!J54,\"W\"&LIST!I54&IF(LIST!J54=0,\"\",\" H\"&LIST!J54)))","v":""}]
[{"$f":"IF(LIST!G55=\"\",\"\",LIST!G55)","v":""},{"$f":"IF(LIST!E55<>\"\",\"人口銘木AL［\"&LIST!E55 &\"] \"&LIST!F55,\"\")","v":""},{"$f":"IF(LIST!G55=\"\",\"\",LIST!K55)","v":""},{"$f":"IF(LIST!O55=\"\",\"\",LIST!O55)","v":""},{"$f":"IF(LIST!H55=\"\",\"\",IF(LIST!I55=0,\"H\"&LIST!J55,\"W\"&LIST!I55&IF(LIST!J55=0,\"\",\" H\"&LIST!J55)))","v":""}]
[{"$f":"IF(LIST!G56=\"\",\"\",LIST!G56)","v":""},{"$f":"IF(LIST!E56<>\"\",\"人口銘木AL［\"&LIST!E56 &\"] \"&LIST!F56,\"\")","v":""},{"$f":"IF(LIST!G56=\"\",\"\",LIST!K56)","v":""},{"$f":"IF(LIST!O56=\"\",\"\",LIST!O56)","v":""},{"$f":"IF(LIST!H56=\"\",\"\",IF(LIST!I56=0,\"H\"&LIST!J56,\"W\"&LIST!I56&IF(LIST!J56=0,\"\",\" H\"&LIST!J56)))","v":""}]
[{"$f":"IF(LIST!G57=\"\",\"\",LIST!G57)","v":""},{"$f":"IF(LIST!E57<>\"\",\"人口銘木AL［\"&LIST!E57 &\"] \"&LIST!F57,\"\")","v":""},{"$f":"IF(LIST!G57=\"\",\"\",LIST!K57)","v":""},{"$f":"IF(LIST!O57=\"\",\"\",LIST!O57)","v":""},{"$f":"IF(LIST!H57=\"\",\"\",IF(LIST!I57=0,\"H\"&LIST!J57,\"W\"&LIST!I57&IF(LIST!J57=0,\"\",\" H\"&LIST!J57)))","v":""}]
[{"$f":"IF(LIST!G58=\"\",\"\",LIST!G58)","v":""},{"$f":"IF(LIST!E58<>\"\",\"人口銘木AL［\"&LIST!E58 &\"] \"&LIST!F58,\"\")","v":""},{"$f":"IF(LIST!G58=\"\",\"\",LIST!K58)","v":""},{"$f":"IF(LIST!O58=\"\",\"\",LIST!O58)","v":""},{"$f":"IF(LIST!H58=\"\",\"\",IF(LIST!I58=0,\"H\"&LIST!J58,\"W\"&LIST!I58&IF(LIST!J58=0,\"\",\" H\"&LIST!J58)))","v":""}]
[{"$f":"IF(LIST!G59=\"\",\"\",LIST!G59)","v":""},{"$f":"IF(LIST!E59<>\"\",\"人口銘木AL［\"&LIST!E59 &\"] \"&LIST!F59,\"\")","v":""},{"$f":"IF(LIST!G59=\"\",\"\",LIST!K59)","v":""},{"$f":"IF(LIST!O59=\"\",\"\",LIST!O59)","v":""},{"$f":"IF(LIST!H59=\"\",\"\",IF(LIST!I59=0,\"H\"&LIST!J59,\"W\"&LIST!I59&IF(LIST!J59=0,\"\",\" H\"&LIST!J59)))","v":""}]
[{"$f":"IF(LIST!G60=\"\",\"\",LIST!G60)","v":""},{"$f":"IF(LIST!E60<>\"\",\"人口銘木AL［\"&LIST!E60 &\"] \"&LIST!F60,\"\")","v":""},{"$f":"IF(LIST!G60=\"\",\"\",LIST!K60)","v":""},{"$f":"IF(LIST!O60=\"\",\"\",LIST!O60)","v":""},{"$f":"IF(LIST!H60=\"\",\"\",IF(LIST!I60=0,\"H\"&LIST!J60,\"W\"&LIST!I60&IF(LIST!J60=0,\"\",\" H\"&LIST!J60)))","v":""}]
[{"$f":"IF(LIST!G61=\"\",\"\",LIST!G61)","v":""},{"$f":"IF(LIST!E61<>\"\",\"人口銘木AL［\"&LIST!E61 &\"] \"&LIST!F61,\"\")","v":""},{"$f":"IF(LIST!G61=\"\",\"\",LIST!K61)","v":""},{"$f":"IF(LIST!O61=\"\",\"\",LIST!O61)","v":""},{"$f":"IF(LIST!H61=\"\",\"\",IF(LIST!I61=0,\"H\"&LIST!J61,\"W\"&LIST!I61&IF(LIST!J61=0,\"\",\" H\"&LIST!J61)))","v":""}]
[{"$f":"IF(LIST!G62=\"\",\"\",LIST!G62)","v":""},{"$f":"IF(LIST!E62<>\"\",\"人口銘木AL［\"&LIST!E62 &\"] \"&LIST!F62,\"\")","v":""},{"$f":"IF(LIST!G62=\"\",\"\",LIST!K62)","v":""},{"$f":"IF(LIST!O62=\"\",\"\",LIST!O62)","v":""},{"$f":"IF(LIST!H62=\"\",\"\",IF(LIST!I62=0,\"H\"&LIST!J62,\"W\"&LIST!I62&IF(LIST!J62=0,\"\",\" H\"&LIST!J62)))","v":""}]
[{"$f":"IF(LIST!G63=\"\",\"\",LIST!G63)","v":""},{"$f":"IF(LIST!E63<>\"\",\"人口銘木AL［\"&LIST!E63 &\"] \"&LIST!F63,\"\")","v":""},{"$f":"IF(LIST!G63=\"\",\"\",LIST!K63)","v":""},{"$f":"IF(LIST!O63=\"\",\"\",LIST!O63)","v":""},{"$f":"IF(LIST!H63=\"\",\"\",IF(LIST!I63=0,\"H\"&LIST!J63,\"W\"&LIST!I63&IF(LIST!J63=0,\"\",\" H\"&LIST!J63)))","v":""}]
[{"$f":"IF(LIST!G64=\"\",\"\",LIST!G64)","v":""},{"$f":"IF(LIST!E64<>\"\",\"人口銘木AL［\"&LIST!E64 &\"] \"&LIST!F64,\"\")","v":""},{"$f":"IF(LIST!G64=\"\",\"\",LIST!K64)","v":""},{"$f":"IF(LIST!O64=\"\",\"\",LIST!O64)","v":""},{"$f":"IF(LIST!H64=\"\",\"\",IF(LIST!I64=0,\"H\"&LIST!J64,\"W\"&LIST!I64&IF(LIST!J64=0,\"\",\" H\"&LIST!J64)))","v":""}]
[{"$f":"IF(LIST!G65=\"\",\"\",LIST!G65)","v":""},{"$f":"IF(LIST!E65<>\"\",\"人口銘木AL［\"&LIST!E65 &\"] \"&LIST!F65,\"\")","v":""},{"$f":"IF(LIST!G65=\"\",\"\",LIST!K65)","v":""},{"$f":"IF(LIST!O65=\"\",\"\",LIST!O65)","v":""},{"$f":"IF(LIST!H65=\"\",\"\",IF(LIST!I65=0,\"H\"&LIST!J65,\"W\"&LIST!I65&IF(LIST!J65=0,\"\",\" H\"&LIST!J65)))","v":""}]
[{"$f":"IF(LIST!G66=\"\",\"\",LIST!G66)","v":""},{"$f":"IF(LIST!E66<>\"\",\"人口銘木AL［\"&LIST!E66 &\"] \"&LIST!F66,\"\")","v":""},{"$f":"IF(LIST!G66=\"\",\"\",LIST!K66)","v":""},{"$f":"IF(LIST!O66=\"\",\"\",LIST!O66)","v":""},{"$f":"IF(LIST!H66=\"\",\"\",IF(LIST!I66=0,\"H\"&LIST!J66,\"W\"&LIST!I66&IF(LIST!J66=0,\"\",\" H\"&LIST!J66)))","v":""}]
[{"$f":"IF(LIST!G67=\"\",\"\",LIST!G67)","v":""},{"$f":"IF(LIST!E67<>\"\",\"人口銘木AL［\"&LIST!E67 &\"] \"&LIST!F67,\"\")","v":""},{"$f":"IF(LIST!G67=\"\",\"\",LIST!K67)","v":""},{"$f":"IF(LIST!O67=\"\",\"\",LIST!O67)","v":""},{"$f":"IF(LIST!H67=\"\",\"\",IF(LIST!I67=0,\"H\"&LIST!J67,\"W\"&LIST!I67&IF(LIST!J67=0,\"\",\" H\"&LIST!J67)))","v":""}]
[{"$f":"IF(LIST!G68=\"\",\"\",LIST!G68)","v":""},{"$f":"IF(LIST!E68<>\"\",\"人口銘木AL［\"&LIST!E68 &\"] \"&LIST!F68,\"\")","v":""},{"$f":"IF(LIST!G68=\"\",\"\",LIST!K68)","v":""},{"$f":"IF(LIST!O68=\"\",\"\",LIST!O68)","v":""},{"$f":"IF(LIST!H68=\"\",\"\",IF(LIST!I68=0,\"H\"&LIST!J68,\"W\"&LIST!I68&IF(LIST!J68=0,\"\",\" H\"&LIST!J68)))","v":""}]
[{"$f":"IF(LIST!G69=\"\",\"\",LIST!G69)","v":""},{"$f":"IF(LIST!E69<>\"\",\"人口銘木AL［\"&LIST!E69 &\"] \"&LIST!F69,\"\")","v":""},{"$f":"IF(LIST!G69=\"\",\"\",LIST!K69)","v":""},{"$f":"IF(LIST!O69=\"\",\"\",LIST!O69)","v":""},{"$f":"IF(LIST!H69=\"\",\"\",IF(LIST!I69=0,\"H\"&LIST!J69,\"W\"&LIST!I69&IF(LIST!J69=0,\"\",\" H\"&LIST!J69)))","v":""}]
[{"$f":"IF(LIST!G70=\"\",\"\",LIST!G70)","v":""},{"$f":"IF(LIST!E70<>\"\",\"人口銘木AL［\"&LIST!E70 &\"] \"&LIST!F70,\"\")","v":""},{"$f":"IF(LIST!G70=\"\",\"\",LIST!K70)","v":""},{"$f":"IF(LIST!O70=\"\",\"\",LIST!O70)","v":""},{"$f":"IF(LIST!H70=\"\",\"\",IF(LIST!I70=0,\"H\"&LIST!J70,\"W\"&LIST!I70&IF(LIST!J70=0,\"\",\" H\"&LIST!J70)))","v":""}]
[{"$f":"IF(LIST!G71=\"\",\"\",LIST!G71)","v":""},{"$f":"IF(LIST!E71<>\"\",\"人口銘木AL［\"&LIST!E71 &\"] \"&LIST!F71,\"\")","v":""},{"$f":"IF(LIST!G71=\"\",\"\",LIST!K71)","v":""},{"$f":"IF(LIST!O71=\"\",\"\",LIST!O71)","v":""},{"$f":"IF(LIST!H71=\"\",\"\",IF(LIST!I71=0,\"H\"&LIST!J71,\"W\"&LIST!I71&IF(LIST!J71=0,\"\",\" H\"&LIST!J71)))","v":""}]
[{"$f":"IF(LIST!G72=\"\",\"\",LIST!G72)","v":""},{"$f":"IF(LIST!E72<>\"\",\"人口銘木AL［\"&LIST!E72 &\"] \"&LIST!F72,\"\")","v":""},{"$f":"IF(LIST!G72=\"\",\"\",LIST!K72)","v":""},{"$f":"IF(LIST!O72=\"\",\"\",LIST!O72)","v":""},{"$f":"IF(LIST!H72=\"\",\"\",IF(LIST!I72=0,\"H\"&LIST!J72,\"W\"&LIST!I72&IF(LIST!J72=0,\"\",\" H\"&LIST!J72)))","v":""}]
[{"$f":"IF(LIST!G73=\"\",\"\",LIST!G73)","v":""},{"$f":"IF(LIST!E73<>\"\",\"人口銘木AL［\"&LIST!E73 &\"] \"&LIST!F73,\"\")","v":""},{"$f":"IF(LIST!G73=\"\",\"\",LIST!K73)","v":""},{"$f":"IF(LIST!O73=\"\",\"\",LIST!O73)","v":""},{"$f":"IF(LIST!H73=\"\",\"\",IF(LIST!I73=0,\"H\"&LIST!J73,\"W\"&LIST!I73&IF(LIST!J73=0,\"\",\" H\"&LIST!J73)))","v":""}]
[{"$f":"IF(LIST!G74=\"\",\"\",LIST!G74)","v":""},{"$f":"IF(LIST!E74<>\"\",\"人口銘木AL［\"&LIST!E74 &\"] \"&LIST!F74,\"\")","v":""},{"$f":"IF(LIST!G74=\"\",\"\",LIST!K74)","v":""},{"$f":"IF(LIST!O74=\"\",\"\",LIST!O74)","v":""},{"$f":"IF(LIST!H74=\"\",\"\",IF(LIST!I74=0,\"H\"&LIST!J74,\"W\"&LIST!I74&IF(LIST!J74=0,\"\",\" H\"&LIST!J74)))","v":""}]
[{"$f":"IF(LIST!G75=\"\",\"\",LIST!G75)","v":""},{"$f":"IF(LIST!E75<>\"\",\"人口銘木AL［\"&LIST!E75 &\"] \"&LIST!F75,\"\")","v":""},{"$f":"IF(LIST!G75=\"\",\"\",LIST!K75)","v":""},{"$f":"IF(LIST!O75=\"\",\"\",LIST!O75)","v":""},{"$f":"IF(LIST!H75=\"\",\"\",IF(LIST!I75=0,\"H\"&LIST!J75,\"W\"&LIST!I75&IF(LIST!J75=0,\"\",\" H\"&LIST!J75)))","v":""}]
[{"$f":"IF(LIST!G76=\"\",\"\",LIST!G76)","v":""},{"$f":"IF(LIST!E76<>\"\",\"人口銘木AL［\"&LIST!E76 &\"] \"&LIST!F76,\"\")","v":""},{"$f":"IF(LIST!G76=\"\",\"\",LIST!K76)","v":""},{"$f":"IF(LIST!O76=\"\",\"\",LIST!O76)","v":""},{"$f":"IF(LIST!H76=\"\",\"\",IF(LIST!I76=0,\"H\"&LIST!J76,\"W\"&LIST!I76&IF(LIST!J76=0,\"\",\" H\"&LIST!J76)))","v":""}]
[{"$f":"IF(LIST!G77=\"\",\"\",LIST!G77)","v":""},{"$f":"IF(LIST!E77<>\"\",\"人口銘木AL［\"&LIST!E77 &\"] \"&LIST!F77,\"\")","v":""},{"$f":"IF(LIST!G77=\"\",\"\",LIST!K77)","v":""},{"$f":"IF(LIST!O77=\"\",\"\",LIST!O77)","v":""},{"$f":"IF(LIST!H77=\"\",\"\",IF(LIST!I77=0,\"H\"&LIST!J77,\"W\"&LIST!I77&IF(LIST!J77=0,\"\",\" H\"&LIST!J77)))","v":""}]
[{"$f":"IF(LIST!G78=\"\",\"\",LIST!G78)","v":""},{"$f":"IF(LIST!E78<>\"\",\"人口銘木AL［\"&LIST!E78 &\"] \"&LIST!F78,\"\")","v":""},{"$f":"IF(LIST!G78=\"\",\"\",LIST!K78)","v":""},{"$f":"IF(LIST!O78=\"\",\"\",LIST!O78)","v":""},{"$f":"IF(LIST!H78=\"\",\"\",IF(LIST!I78=0,\"H\"&LIST!J78,\"W\"&LIST!I78&IF(LIST!J78=0,\"\",\" H\"&LIST!J78)))","v":""}]
[{"$f":"IF(LIST!G79=\"\",\"\",LIST!G79)","v":""},{"$f":"IF(LIST!E79<>\"\",\"人口銘木AL［\"&LIST!E79 &\"] \"&LIST!F79,\"\")","v":""},{"$f":"IF(LIST!G79=\"\",\"\",LIST!K79)","v":""},{"$f":"IF(LIST!O79=\"\",\"\",LIST!O79)","v":""},{"$f":"IF(LIST!H79=\"\",\"\",IF(LIST!I79=0,\"H\"&LIST!J79,\"W\"&LIST!I79&IF(LIST!J79=0,\"\",\" H\"&LIST!J79)))","v":""}]
[{"$f":"IF(LIST!G80=\"\",\"\",LIST!G80)","v":""},{"$f":"IF(LIST!E80<>\"\",\"人口銘木AL［\"&LIST!E80 &\"] \"&LIST!F80,\"\")","v":""},{"$f":"IF(LIST!G80=\"\",\"\",LIST!K80)","v":""},{"$f":"IF(LIST!O80=\"\",\"\",LIST!O80)","v":""},{"$f":"IF(LIST!H80=\"\",\"\",IF(LIST!I80=0,\"H\"&LIST!J80,\"W\"&LIST!I80&IF(LIST!J80=0,\"\",\" H\"&LIST!J80)))","v":""}]
[{"$f":"IF(LIST!G81=\"\",\"\",LIST!G81)","v":""},{"$f":"IF(LIST!E81<>\"\",\"人口銘木AL［\"&LIST!E81 &\"] \"&LIST!F81,\"\")","v":""},{"$f":"IF(LIST!G81=\"\",\"\",LIST!K81)","v":""},{"$f":"IF(LIST!O81=\"\",\"\",LIST!O81)","v":""},{"$f":"IF(LIST!H81=\"\",\"\",IF(LIST!I81=0,\"H\"&LIST!J81,\"W\"&LIST!I81&IF(LIST!J81=0,\"\",\" H\"&LIST!J81)))","v":""}]
[{"$f":"IF(LIST!G82=\"\",\"\",LIST!G82)","v":""},{"$f":"IF(LIST!E82<>\"\",\"人口銘木AL［\"&LIST!E82 &\"] \"&LIST!F82,\"\")","v":""},{"$f":"IF(LIST!G82=\"\",\"\",LIST!K82)","v":""},{"$f":"IF(LIST!O82=\"\",\"\",LIST!O82)","v":""},{"$f":"IF(LIST!H82=\"\",\"\",IF(LIST!I82=0,\"H\"&LIST!J82,\"W\"&LIST!I82&IF(LIST!J82=0,\"\",\" H\"&LIST!J82)))","v":""}]
[{"$f":"IF(LIST!G83=\"\",\"\",LIST!G83)","v":""},{"$f":"IF(LIST!E83<>\"\",\"人口銘木AL［\"&LIST!E83 &\"] \"&LIST!F83,\"\")","v":""},{"$f":"IF(LIST!G83=\"\",\"\",LIST!K83)","v":""},{"$f":"IF(LIST!O83=\"\",\"\",LIST!O83)","v":""},{"$f":"IF(LIST!H83=\"\",\"\",IF(LIST!I83=0,\"H\"&LIST!J83,\"W\"&LIST!I83&IF(LIST!J83=0,\"\",\" H\"&LIST!J83)))","v":""}]
[{"$f":"IF(LIST!G84=\"\",\"\",LIST!G84)","v":""},{"$f":"IF(LIST!E84<>\"\",\"人口銘木AL［\"&LIST!E84 &\"] \"&LIST!F84,\"\")","v":""},{"$f":"IF(LIST!G84=\"\",\"\",LIST!K84)","v":""},{"$f":"IF(LIST!O84=\"\",\"\",LIST!O84)","v":""},{"$f":"IF(LIST!H84=\"\",\"\",IF(LIST!I84=0,\"H\"&LIST!J84,\"W\"&LIST!I84&IF(LIST!J84=0,\"\",\" H\"&LIST!J84)))","v":""}]
[{"$f":"IF(LIST!G85=\"\",\"\",LIST!G85)","v":""},{"$f":"IF(LIST!E85<>\"\",\"人口銘木AL［\"&LIST!E85 &\"] \"&LIST!F85,\"\")","v":""},{"$f":"IF(LIST!G85=\"\",\"\",LIST!K85)","v":""},{"$f":"IF(LIST!O85=\"\",\"\",LIST!O85)","v":""},{"$f":"IF(LIST!H85=\"\",\"\",IF(LIST!I85=0,\"H\"&LIST!J85,\"W\"&LIST!I85&IF(LIST!J85=0,\"\",\" H\"&LIST!J85)))","v":""}]
[{"$f":"IF(LIST!G86=\"\",\"\",LIST!G86)","v":""},{"$f":"IF(LIST!E86<>\"\",\"人口銘木AL［\"&LIST!E86 &\"] \"&LIST!F86,\"\")","v":""},{"$f":"IF(LIST!G86=\"\",\"\",LIST!K86)","v":""},{"$f":"IF(LIST!O86=\"\",\"\",LIST!O86)","v":""},{"$f":"IF(LIST!H86=\"\",\"\",IF(LIST!I86=0,\"H\"&LIST!J86,\"W\"&LIST!I86&IF(LIST!J86=0,\"\",\" H\"&LIST!J86)))","v":""}]
[{"$f":"IF(LIST!G87=\"\",\"\",LIST!G87)","v":""},{"$f":"IF(LIST!E87<>\"\",\"人口銘木AL［\"&LIST!E87 &\"] \"&LIST!F87,\"\")","v":""},{"$f":"IF(LIST!G87=\"\",\"\",LIST!K87)","v":""},{"$f":"IF(LIST!O87=\"\",\"\",LIST!O87)","v":""},{"$f":"IF(LIST!H87=\"\",\"\",IF(LIST!I87=0,\"H\"&LIST!J87,\"W\"&LIST!I87&IF(LIST!J87=0,\"\",\" H\"&LIST!J87)))","v":""}]
[{"$f":"IF(LIST!G88=\"\",\"\",LIST!G88)","v":""},{"$f":"IF(LIST!E88<>\"\",\"人口銘木AL［\"&LIST!E88 &\"] \"&LIST!F88,\"\")","v":""},{"$f":"IF(LIST!G88=\"\",\"\",LIST!K88)","v":""},{"$f":"IF(LIST!O88=\"\",\"\",LIST!O88)","v":""},{"$f":"IF(LIST!H88=\"\",\"\",IF(LIST!I88=0,\"H\"&LIST!J88,\"W\"&LIST!I88&IF(LIST!J88=0,\"\",\" H\"&LIST!J88)))","v":""}]
[{"$f":"IF(LIST!G89=\"\",\"\",LIST!G89)","v":""},{"$f":"IF(LIST!E89<>\"\",\"人口銘木AL［\"&LIST!E89 &\"] \"&LIST!F89,\"\")","v":""},{"$f":"IF(LIST!G89=\"\",\"\",LIST!K89)","v":""},{"$f":"IF(LIST!O89=\"\",\"\",LIST!O89)","v":""},{"$f":"IF(LIST!H89=\"\",\"\",IF(LIST!I89=0,\"H\"&LIST!J89,\"W\"&LIST!I89&IF(LIST!J89=0,\"\",\" H\"&LIST!J89)))","v":""}]
[{"$f":"IF(LIST!G90=\"\",\"\",LIST!G90)","v":""},{"$f":"IF(LIST!E90<>\"\",\"人口銘木AL［\"&LIST!E90 &\"] \"&LIST!F90,\"\")","v":""},{"$f":"IF(LIST!G90=\"\",\"\",LIST!K90)","v":""},{"$f":"IF(LIST!O90=\"\",\"\",LIST!O90)","v":""},{"$f":"IF(LIST!H90=\"\",\"\",IF(LIST!I90=0,\"H\"&LIST!J90,\"W\"&LIST!I90&IF(LIST!J90=0,\"\",\" H\"&LIST!J90)))","v":""}]
[{"$f":"IF(LIST!G91=\"\",\"\",LIST!G91)","v":""},{"$f":"IF(LIST!E91<>\"\",\"人口銘木AL［\"&LIST!E91 &\"] \"&LIST!F91,\"\")","v":""},{"$f":"IF(LIST!G91=\"\",\"\",LIST!K91)","v":""},{"$f":"IF(LIST!O91=\"\",\"\",LIST!O91)","v":""},{"$f":"IF(LIST!H91=\"\",\"\",IF(LIST!I91=0,\"H\"&LIST!J91,\"W\"&LIST!I91&IF(LIST!J91=0,\"\",\" H\"&LIST!J91)))","v":""}]
[{"$f":"IF(LIST!G92=\"\",\"\",LIST!G92)","v":""},{"$f":"IF(LIST!E92<>\"\",\"人口銘木AL［\"&LIST!E92 &\"] \"&LIST!F92,\"\")","v":""},{"$f":"IF(LIST!G92=\"\",\"\",LIST!K92)","v":""},{"$f":"IF(LIST!O92=\"\",\"\",LIST!O92)","v":""},{"$f":"IF(LIST!H92=\"\",\"\",IF(LIST!I92=0,\"H\"&LIST!J92,\"W\"&LIST!I92&IF(LIST!J92=0,\"\",\" H\"&LIST!J92)))","v":""}]
[{"$f":"IF(LIST!G93=\"\",\"\",LIST!G93)","v":""},{"$f":"IF(LIST!E93<>\"\",\"人口銘木AL［\"&LIST!E93 &\"] \"&LIST!F93,\"\")","v":""},{"$f":"IF(LIST!G93=\"\",\"\",LIST!K93)","v":""},{"$f":"IF(LIST!O93=\"\",\"\",LIST!O93)","v":""},{"$f":"IF(LIST!H93=\"\",\"\",IF(LIST!I93=0,\"H\"&LIST!J93,\"W\"&LIST!I93&IF(LIST!J93=0,\"\",\" H\"&LIST!J93)))","v":""}]
[{"$f":"IF(LIST!G94=\"\",\"\",LIST!G94)","v":""},{"$f":"IF(LIST!E94<>\"\",\"人口銘木AL［\"&LIST!E94 &\"] \"&LIST!F94,\"\")","v":""},{"$f":"IF(LIST!G94=\"\",\"\",LIST!K94)","v":""},{"$f":"IF(LIST!O94=\"\",\"\",LIST!O94)","v":""},{"$f":"IF(LIST!H94=\"\",\"\",IF(LIST!I94=0,\"H\"&LIST!J94,\"W\"&LIST!I94&IF(LIST!J94=0,\"\",\" H\"&LIST!J94)))","v":""}]
[{"$f":"IF(LIST!G95=\"\",\"\",LIST!G95)","v":""},{"$f":"IF(LIST!E95<>\"\",\"人口銘木AL［\"&LIST!E95 &\"] \"&LIST!F95,\"\")","v":""},{"$f":"IF(LIST!G95=\"\",\"\",LIST!K95)","v":""},{"$f":"IF(LIST!O95=\"\",\"\",LIST!O95)","v":""},{"$f":"IF(LIST!H95=\"\",\"\",IF(LIST!I95=0,\"H\"&LIST!J95,\"W\"&LIST!I95&IF(LIST!J95=0,\"\",\" H\"&LIST!J95)))","v":""}]
[{"$f":"IF(LIST!G96=\"\",\"\",LIST!G96)","v":""},{"$f":"IF(LIST!E96<>\"\",\"人口銘木AL［\"&LIST!E96 &\"] \"&LIST!F96,\"\")","v":""},{"$f":"IF(LIST!G96=\"\",\"\",LIST!K96)","v":""},{"$f":"IF(LIST!O96=\"\",\"\",LIST!O96)","v":""},{"$f":"IF(LIST!H96=\"\",\"\",IF(LIST!I96=0,\"H\"&LIST!J96,\"W\"&LIST!I96&IF(LIST!J96=0,\"\",\" H\"&LIST!J96)))","v":""}]
[{"$f":"IF(LIST!G97=\"\",\"\",LIST!G97)","v":""},{"$f":"IF(LIST!E97<>\"\",\"人口銘木AL［\"&LIST!E97 &\"] \"&LIST!F97,\"\")","v":""},{"$f":"IF(LIST!G97=\"\",\"\",LIST!K97)","v":""},{"$f":"IF(LIST!O97=\"\",\"\",LIST!O97)","v":""},{"$f":"IF(LIST!H97=\"\",\"\",IF(LIST!I97=0,\"H\"&LIST!J97,\"W\"&LIST!I97&IF(LIST!J97=0,\"\",\" H\"&LIST!J97)))","v":""}]
[{"$f":"IF(LIST!G98=\"\",\"\",LIST!G98)","v":""},{"$f":"IF(LIST!E98<>\"\",\"人口銘木AL［\"&LIST!E98 &\"] \"&LIST!F98,\"\")","v":""},{"$f":"IF(LIST!G98=\"\",\"\",LIST!K98)","v":""},{"$f":"IF(LIST!O98=\"\",\"\",LIST!O98)","v":""},{"$f":"IF(LIST!H98=\"\",\"\",IF(LIST!I98=0,\"H\"&LIST!J98,\"W\"&LIST!I98&IF(LIST!J98=0,\"\",\" H\"&LIST!J98)))","v":""}]
[{"$f":"IF(LIST!G99=\"\",\"\",LIST!G99)","v":""},{"$f":"IF(LIST!E99<>\"\",\"人口銘木AL［\"&LIST!E99 &\"] \"&LIST!F99,\"\")","v":""},{"$f":"IF(LIST!G99=\"\",\"\",LIST!K99)","v":""},{"$f":"IF(LIST!O99=\"\",\"\",LIST!O99)","v":""},{"$f":"IF(LIST!H99=\"\",\"\",IF(LIST!I99=0,\"H\"&LIST!J99,\"W\"&LIST!I99&IF(LIST!J99=0,\"\",\" H\"&LIST!J99)))","v":""}]
[{"$f":"IF(LIST!G100=\"\",\"\",LIST!G100)","v":""},{"$f":"IF(LIST!E100<>\"\",\"人口銘木AL［\"&LIST!E100 &\"] \"&LIST!F100,\"\")","v":""},{"$f":"IF(LIST!G100=\"\",\"\",LIST!K100)","v":""},{"$f":"IF(LIST!O100=\"\",\"\",LIST!O100)","v":""},{"$f":"IF(LIST!H100=\"\",\"\",IF(LIST!I100=0,\"H\"&LIST!J100,\"W\"&LIST!I100&IF(LIST!J100=0,\"\",\" H\"&LIST!J100)))","v":""}]
[{"$f":"IF(LIST!G101=\"\",\"\",LIST!G101)","v":""},{"$f":"IF(LIST!E101<>\"\",\"人口銘木AL［\"&LIST!E101 &\"] \"&LIST!F101,\"\")","v":""},{"$f":"IF(LIST!G101=\"\",\"\",LIST!K101)","v":""},{"$f":"IF(LIST!O101=\"\",\"\",LIST!O101)","v":""},{"$f":"IF(LIST!H101=\"\",\"\",IF(LIST!I101=0,\"H\"&LIST!J101,\"W\"&LIST!I101&IF(LIST!J101=0,\"\",\" H\"&LIST!J101)))","v":""}]
[{"$f":"IF(LIST!G102=\"\",\"\",LIST!G102)","v":""},{"$f":"IF(LIST!E102<>\"\",\"人口銘木AL［\"&LIST!E102 &\"] \"&LIST!F102,\"\")","v":""},{"$f":"IF(LIST!G102=\"\",\"\",LIST!K102)","v":""},{"$f":"IF(LIST!O102=\"\",\"\",LIST!O102)","v":""},{"$f":"IF(LIST!H102=\"\",\"\",IF(LIST!I102=0,\"H\"&LIST!J102,\"W\"&LIST!I102&IF(LIST!J102=0,\"\",\" H\"&LIST!J102)))","v":""}]
[{"$f":"IF(LIST!G103=\"\",\"\",LIST!G103)","v":""},{"$f":"IF(LIST!E103<>\"\",\"人口銘木AL［\"&LIST!E103 &\"] \"&LIST!F103,\"\")","v":""},{"$f":"IF(LIST!G103=\"\",\"\",LIST!K103)","v":""},{"$f":"IF(LIST!O103=\"\",\"\",LIST!O103)","v":""},{"$f":"IF(LIST!H103=\"\",\"\",IF(LIST!I103=0,\"H\"&LIST!J103,\"W\"&LIST!I103&IF(LIST!J103=0,\"\",\" H\"&LIST!J103)))","v":""}]
[{"$f":"IF(LIST!G104=\"\",\"\",LIST!G104)","v":""},{"$f":"IF(LIST!E104<>\"\",\"人口銘木AL［\"&LIST!E104 &\"] \"&LIST!F104,\"\")","v":""},{"$f":"IF(LIST!G104=\"\",\"\",LIST!K104)","v":""},{"$f":"IF(LIST!O104=\"\",\"\",LIST!O104)","v":""},{"$f":"IF(LIST!H104=\"\",\"\",IF(LIST!I104=0,\"H\"&LIST!J104,\"W\"&LIST!I104&IF(LIST!J104=0,\"\",\" H\"&LIST!J104)))","v":""}]
[{"$f":"IF(LIST!G105=\"\",\"\",LIST!G105)","v":""},{"$f":"IF(LIST!E105<>\"\",\"人口銘木AL［\"&LIST!E105 &\"] \"&LIST!F105,\"\")","v":""},{"$f":"IF(LIST!G105=\"\",\"\",LIST!K105)","v":""},{"$f":"IF(LIST!O105=\"\",\"\",LIST!O105)","v":""},{"$f":"IF(LIST!H105=\"\",\"\",IF(LIST!I105=0,\"H\"&LIST!J105,\"W\"&LIST!I105&IF(LIST!J105=0,\"\",\" H\"&LIST!J105)))","v":""}]
[{"$f":"IF(LIST!G106=\"\",\"\",LIST!G106)","v":""},{"$f":"IF(LIST!E106<>\"\",\"人口銘木AL［\"&LIST!E106 &\"] \"&LIST!F106,\"\")","v":""},{"$f":"IF(LIST!G106=\"\",\"\",LIST!K106)","v":""},{"$f":"IF(LIST!O106=\"\",\"\",LIST!O106)","v":""},{"$f":"IF(LIST!H106=\"\",\"\",IF(LIST!I106=0,\"H\"&LIST!J106,\"W\"&LIST!I106&IF(LIST!J106=0,\"\",\" H\"&LIST!J106)))","v":""}]
[{"$f":"IF(LIST!G107=\"\",\"\",LIST!G107)","v":""},{"$f":"IF(LIST!E107<>\"\",\"人口銘木AL［\"&LIST!E107 &\"] \"&LIST!F107,\"\")","v":""},{"$f":"IF(LIST!G107=\"\",\"\",LIST!K107)","v":""},{"$f":"IF(LIST!O107=\"\",\"\",LIST!O107)","v":""},{"$f":"IF(LIST!H107=\"\",\"\",IF(LIST!I107=0,\"H\"&LIST!J107,\"W\"&LIST!I107&IF(LIST!J107=0,\"\",\" H\"&LIST!J107)))","v":""}]
[{"$f":"IF(LIST!G108=\"\",\"\",LIST!G108)","v":""},{"$f":"IF(LIST!E108<>\"\",\"人口銘木AL［\"&LIST!E108 &\"] \"&LIST!F108,\"\")","v":""},{"$f":"IF(LIST!G108=\"\",\"\",LIST!K108)","v":""},{"$f":"IF(LIST!O108=\"\",\"\",LIST!O108)","v":""},{"$f":"IF(LIST!H108=\"\",\"\",IF(LIST!I108=0,\"H\"&LIST!J108,\"W\"&LIST!I108&IF(LIST!J108=0,\"\",\" H\"&LIST!J108)))","v":""}]
[{"$f":"IF(LIST!G109=\"\",\"\",LIST!G109)","v":""},{"$f":"IF(LIST!E109<>\"\",\"人口銘木AL［\"&LIST!E109 &\"] \"&LIST!F109,\"\")","v":""},{"$f":"IF(LIST!G109=\"\",\"\",LIST!K109)","v":""},{"$f":"IF(LIST!O109=\"\",\"\",LIST!O109)","v":""},{"$f":"IF(LIST!H109=\"\",\"\",IF(LIST!I109=0,\"H\"&LIST!J109,\"W\"&LIST!I109&IF(LIST!J109=0,\"\",\" H\"&LIST!J109)))","v":""}]
[{"$f":"IF(LIST!G110=\"\",\"\",LIST!G110)","v":""},{"$f":"IF(LIST!E110<>\"\",\"人口銘木AL［\"&LIST!E110 &\"] \"&LIST!F110,\"\")","v":""},{"$f":"IF(LIST!G110=\"\",\"\",LIST!K110)","v":""},{"$f":"IF(LIST!O110=\"\",\"\",LIST!O110)","v":""},{"$f":"IF(LIST!H110=\"\",\"\",IF(LIST!I110=0,\"H\"&LIST!J110,\"W\"&LIST!I110&IF(LIST!J110=0,\"\",\" H\"&LIST!J110)))","v":""}]
[{"$f":"IF(LIST!G111=\"\",\"\",LIST!G111)","v":""},{"$f":"IF(LIST!E111<>\"\",\"人口銘木AL［\"&LIST!E111 &\"] \"&LIST!F111,\"\")","v":""},{"$f":"IF(LIST!G111=\"\",\"\",LIST!K111)","v":""},{"$f":"IF(LIST!O111=\"\",\"\",LIST!O111)","v":""},{"$f":"IF(LIST!H111=\"\",\"\",IF(LIST!I111=0,\"H\"&LIST!J111,\"W\"&LIST!I111&IF(LIST!J111=0,\"\",\" H\"&LIST!J111)))","v":""}]
[{"$f":"IF(LIST!G112=\"\",\"\",LIST!G112)","v":""},{"$f":"IF(LIST!E112<>\"\",\"人口銘木AL［\"&LIST!E112 &\"] \"&LIST!F112,\"\")","v":""},{"$f":"IF(LIST!G112=\"\",\"\",LIST!K112)","v":""},{"$f":"IF(LIST!O112=\"\",\"\",LIST!O112)","v":""},{"$f":"IF(LIST!H112=\"\",\"\",IF(LIST!I112=0,\"H\"&LIST!J112,\"W\"&LIST!I112&IF(LIST!J112=0,\"\",\" H\"&LIST!J112)))","v":""}]
[{"$f":"IF(LIST!G113=\"\",\"\",LIST!G113)","v":""},{"$f":"IF(LIST!E113<>\"\",\"人口銘木AL［\"&LIST!E113 &\"] \"&LIST!F113,\"\")","v":""},{"$f":"IF(LIST!G113=\"\",\"\",LIST!K113)","v":""},{"$f":"IF(LIST!O113=\"\",\"\",LIST!O113)","v":""},{"$f":"IF(LIST!H113=\"\",\"\",IF(LIST!I113=0,\"H\"&LIST!J113,\"W\"&LIST!I113&IF(LIST!J113=0,\"\",\" H\"&LIST!J113)))","v":""}]
[{"$f":"IF(LIST!G114=\"\",\"\",LIST!G114)","v":""},{"$f":"IF(LIST!E114<>\"\",\"人口銘木AL［\"&LIST!E114 &\"] \"&LIST!F114,\"\")","v":""},{"$f":"IF(LIST!G114=\"\",\"\",LIST!K114)","v":""},{"$f":"IF(LIST!O114=\"\",\"\",LIST!O114)","v":""},{"$f":"IF(LIST!H114=\"\",\"\",IF(LIST!I114=0,\"H\"&LIST!J114,\"W\"&LIST!I114&IF(LIST!J114=0,\"\",\" H\"&LIST!J114)))","v":""}]
[{"$f":"IF(LIST!G115=\"\",\"\",LIST!G115)","v":""},{"$f":"IF(LIST!E115<>\"\",\"人口銘木AL［\"&LIST!E115 &\"] \"&LIST!F115,\"\")","v":""},{"$f":"IF(LIST!G115=\"\",\"\",LIST!K115)","v":""},{"$f":"IF(LIST!O115=\"\",\"\",LIST!O115)","v":""},{"$f":"IF(LIST!H115=\"\",\"\",IF(LIST!I115=0,\"H\"&LIST!J115,\"W\"&LIST!I115&IF(LIST!J115=0,\"\",\" H\"&LIST!J115)))","v":""}]
[{"$f":"IF(LIST!G116=\"\",\"\",LIST!G116)","v":""},{"$f":"IF(LIST!E116<>\"\",\"人口銘木AL［\"&LIST!E116 &\"] \"&LIST!F116,\"\")","v":""},{"$f":"IF(LIST!G116=\"\",\"\",LIST!K116)","v":""},{"$f":"IF(LIST!O116=\"\",\"\",LIST!O116)","v":""},{"$f":"IF(LIST!H116=\"\",\"\",IF(LIST!I116=0,\"H\"&LIST!J116,\"W\"&LIST!I116&IF(LIST!J116=0,\"\",\" H\"&LIST!J116)))","v":""}]
[{"$f":"IF(LIST!G117=\"\",\"\",LIST!G117)","v":""},{"$f":"IF(LIST!E117<>\"\",\"人口銘木AL［\"&LIST!E117 &\"] \"&LIST!F117,\"\")","v":""},{"$f":"IF(LIST!G117=\"\",\"\",LIST!K117)","v":""},{"$f":"IF(LIST!O117=\"\",\"\",LIST!O117)","v":""},{"$f":"IF(LIST!H117=\"\",\"\",IF(LIST!I117=0,\"H\"&LIST!J117,\"W\"&LIST!I117&IF(LIST!J117=0,\"\",\" H\"&LIST!J117)))","v":""}]
[{"$f":"IF(LIST!G118=\"\",\"\",LIST!G118)","v":""},{"$f":"IF(LIST!E118<>\"\",\"人口銘木AL［\"&LIST!E118 &\"] \"&LIST!F118,\"\")","v":""},{"$f":"IF(LIST!G118=\"\",\"\",LIST!K118)","v":""},{"$f":"IF(LIST!O118=\"\",\"\",LIST!O118)","v":""},{"$f":"IF(LIST!H118=\"\",\"\",IF(LIST!I118=0,\"H\"&LIST!J118,\"W\"&LIST!I118&IF(LIST!J118=0,\"\",\" H\"&LIST!J118)))","v":""}]
[{"$f":"IF(LIST!G119=\"\",\"\",LIST!G119)","v":""},{"$f":"IF(LIST!E119<>\"\",\"人口銘木AL［\"&LIST!E119 &\"] \"&LIST!F119,\"\")","v":""},{"$f":"IF(LIST!G119=\"\",\"\",LIST!K119)","v":""},{"$f":"IF(LIST!O119=\"\",\"\",LIST!O119)","v":""},{"$f":"IF(LIST!H119=\"\",\"\",IF(LIST!I119=0,\"H\"&LIST!J119,\"W\"&LIST!I119&IF(LIST!J119=0,\"\",\" H\"&LIST!J119)))","v":""}]
[{"$f":"IF(LIST!G120=\"\",\"\",LIST!G120)","v":""},{"$f":"IF(LIST!E120<>\"\",\"人口銘木AL［\"&LIST!E120 &\"] \"&LIST!F120,\"\")","v":""},{"$f":"IF(LIST!G120=\"\",\"\",LIST!K120)","v":""},{"$f":"IF(LIST!O120=\"\",\"\",LIST!O120)","v":""},{"$f":"IF(LIST!H120=\"\",\"\",IF(LIST!I120=0,\"H\"&LIST!J120,\"W\"&LIST!I120&IF(LIST!J120=0,\"\",\" H\"&LIST!J120)))","v":""}]
[{"$f":"IF(LIST!G121=\"\",\"\",LIST!G121)","v":""},{"$f":"IF(LIST!E121<>\"\",\"人口銘木AL［\"&LIST!E121 &\"] \"&LIST!F121,\"\")","v":""},{"$f":"IF(LIST!G121=\"\",\"\",LIST!K121)","v":""},{"$f":"IF(LIST!O121=\"\",\"\",LIST!O121)","v":""},{"$f":"IF(LIST!H121=\"\",\"\",IF(LIST!I121=0,\"H\"&LIST!J121,\"W\"&LIST!I121&IF(LIST!J121=0,\"\",\" H\"&LIST!J121)))","v":""}]
[{"$f":"IF(LIST!G122=\"\",\"\",LIST!G122)","v":""},{"$f":"IF(LIST!E122<>\"\",\"人口銘木AL［\"&LIST!E122 &\"] \"&LIST!F122,\"\")","v":""},{"$f":"IF(LIST!G122=\"\",\"\",LIST!K122)","v":""},{"$f":"IF(LIST!O122=\"\",\"\",LIST!O122)","v":""},{"$f":"IF(LIST!H122=\"\",\"\",IF(LIST!I122=0,\"H\"&LIST!J122,\"W\"&LIST!I122&IF(LIST!J122=0,\"\",\" H\"&LIST!J122)))","v":""}]
[{"$f":"IF(LIST!G123=\"\",\"\",LIST!G123)","v":""},{"$f":"IF(LIST!E123<>\"\",\"人口銘木AL［\"&LIST!E123 &\"] \"&LIST!F123,\"\")","v":""},{"$f":"IF(LIST!G123=\"\",\"\",LIST!K123)","v":""},{"$f":"IF(LIST!O123=\"\",\"\",LIST!O123)","v":""},{"$f":"IF(LIST!H123=\"\",\"\",IF(LIST!I123=0,\"H\"&LIST!J123,\"W\"&LIST!I123&IF(LIST!J123=0,\"\",\" H\"&LIST!J123)))","v":""}]
[{"$f":"IF(LIST!G124=\"\",\"\",LIST!G124)","v":""},{"$f":"IF(LIST!E124<>\"\",\"人口銘木AL［\"&LIST!E124 &\"] \"&LIST!F124,\"\")","v":""},{"$f":"IF(LIST!G124=\"\",\"\",LIST!K124)","v":""},{"$f":"IF(LIST!O124=\"\",\"\",LIST!O124)","v":""},{"$f":"IF(LIST!H124=\"\",\"\",IF(LIST!I124=0,\"H\"&LIST!J124,\"W\"&LIST!I124&IF(LIST!J124=0,\"\",\" H\"&LIST!J124)))","v":""}]
[{"$f":"IF(LIST!G125=\"\",\"\",LIST!G125)","v":""},{"$f":"IF(LIST!E125<>\"\",\"人口銘木AL［\"&LIST!E125 &\"] \"&LIST!F125,\"\")","v":""},{"$f":"IF(LIST!G125=\"\",\"\",LIST!K125)","v":""},{"$f":"IF(LIST!O125=\"\",\"\",LIST!O125)","v":""},{"$f":"IF(LIST!H125=\"\",\"\",IF(LIST!I125=0,\"H\"&LIST!J125,\"W\"&LIST!I125&IF(LIST!J125=0,\"\",\" H\"&LIST!J125)))","v":""}]
[{"$f":"IF(LIST!G126=\"\",\"\",LIST!G126)","v":""},{"$f":"IF(LIST!E126<>\"\",\"人口銘木AL［\"&LIST!E126 &\"] \"&LIST!F126,\"\")","v":""},{"$f":"IF(LIST!G126=\"\",\"\",LIST!K126)","v":""},{"$f":"IF(LIST!O126=\"\",\"\",LIST!O126)","v":""},{"$f":"IF(LIST!H126=\"\",\"\",IF(LIST!I126=0,\"H\"&LIST!J126,\"W\"&LIST!I126&IF(LIST!J126=0,\"\",\" H\"&LIST!J126)))","v":""}]
[{"$f":"IF(LIST!G127=\"\",\"\",LIST!G127)","v":""},{"$f":"IF(LIST!E127<>\"\",\"人口銘木AL［\"&LIST!E127 &\"] \"&LIST!F127,\"\")","v":""},{"$f":"IF(LIST!G127=\"\",\"\",LIST!K127)","v":""},{"$f":"IF(LIST!O127=\"\",\"\",LIST!O127)","v":""},{"$f":"IF(LIST!H127=\"\",\"\",IF(LIST!I127=0,\"H\"&LIST!J127,\"W\"&LIST!I127&IF(LIST!J127=0,\"\",\" H\"&LIST!J127)))","v":""}]
[{"$f":"IF(LIST!G128=\"\",\"\",LIST!G128)","v":""},{"$f":"IF(LIST!E128<>\"\",\"人口銘木AL［\"&LIST!E128 &\"] \"&LIST!F128,\"\")","v":""},{"$f":"IF(LIST!G128=\"\",\"\",LIST!K128)","v":""},{"$f":"IF(LIST!O128=\"\",\"\",LIST!O128)","v":""},{"$f":"IF(LIST!H128=\"\",\"\",IF(LIST!I128=0,\"H\"&LIST!J128,\"W\"&LIST!I128&IF(LIST!J128=0,\"\",\" H\"&LIST!J128)))","v":""}]
[{"$f":"IF(LIST!G129=\"\",\"\",LIST!G129)","v":""},{"$f":"IF(LIST!E129<>\"\",\"人口銘木AL［\"&LIST!E129 &\"] \"&LIST!F129,\"\")","v":""},{"$f":"IF(LIST!G129=\"\",\"\",LIST!K129)","v":""},{"$f":"IF(LIST!O129=\"\",\"\",LIST!O129)","v":""},{"$f":"IF(LIST!H129=\"\",\"\",IF(LIST!I129=0,\"H\"&LIST!J129,\"W\"&LIST!I129&IF(LIST!J129=0,\"\",\" H\"&LIST!J129)))","v":""}]
[{"$f":"IF(LIST!G130=\"\",\"\",LIST!G130)","v":""},{"$f":"IF(LIST!E130<>\"\",\"人口銘木AL［\"&LIST!E130 &\"] \"&LIST!F130,\"\")","v":""},{"$f":"IF(LIST!G130=\"\",\"\",LIST!K130)","v":""},{"$f":"IF(LIST!O130=\"\",\"\",LIST!O130)","v":""},{"$f":"IF(LIST!H130=\"\",\"\",IF(LIST!I130=0,\"H\"&LIST!J130,\"W\"&LIST!I130&IF(LIST!J130=0,\"\",\" H\"&LIST!J130)))","v":""}]
[{"$f":"IF(LIST!G131=\"\",\"\",LIST!G131)","v":""},{"$f":"IF(LIST!E131<>\"\",\"人口銘木AL［\"&LIST!E131 &\"] \"&LIST!F131,\"\")","v":""},{"$f":"IF(LIST!G131=\"\",\"\",LIST!K131)","v":""},{"$f":"IF(LIST!O131=\"\",\"\",LIST!O131)","v":""},{"$f":"IF(LIST!H131=\"\",\"\",IF(LIST!I131=0,\"H\"&LIST!J131,\"W\"&LIST!I131&IF(LIST!J131=0,\"\",\" H\"&LIST!J131)))","v":""}]
[{"$f":"IF(LIST!G132=\"\",\"\",LIST!G132)","v":""},{"$f":"IF(LIST!E132<>\"\",\"人口銘木AL［\"&LIST!E132 &\"] \"&LIST!F132,\"\")","v":""},{"$f":"IF(LIST!G132=\"\",\"\",LIST!K132)","v":""},{"$f":"IF(LIST!O132=\"\",\"\",LIST!O132)","v":""},{"$f":"IF(LIST!H132=\"\",\"\",IF(LIST!I132=0,\"H\"&LIST!J132,\"W\"&LIST!I132&IF(LIST!J132=0,\"\",\" H\"&LIST!J132)))","v":""}]
[{"$f":"IF(LIST!G133=\"\",\"\",LIST!G133)","v":""},{"$f":"IF(LIST!E133<>\"\",\"人口銘木AL［\"&LIST!E133 &\"] \"&LIST!F133,\"\")","v":""},{"$f":"IF(LIST!G133=\"\",\"\",LIST!K133)","v":""},{"$f":"IF(LIST!O133=\"\",\"\",LIST!O133)","v":""},{"$f":"IF(LIST!H133=\"\",\"\",IF(LIST!I133=0,\"H\"&LIST!J133,\"W\"&LIST!I133&IF(LIST!J133=0,\"\",\" H\"&LIST!J133)))","v":""}]
[{"$f":"IF(LIST!G134=\"\",\"\",LIST!G134)","v":""},{"$f":"IF(LIST!E134<>\"\",\"人口銘木AL［\"&LIST!E134 &\"] \"&LIST!F134,\"\")","v":""},{"$f":"IF(LIST!G134=\"\",\"\",LIST!K134)","v":""},{"$f":"IF(LIST!O134=\"\",\"\",LIST!O134)","v":""},{"$f":"IF(LIST!H134=\"\",\"\",IF(LIST!I134=0,\"H\"&LIST!J134,\"W\"&LIST!I134&IF(LIST!J134=0,\"\",\" H\"&LIST!J134)))","v":""}]
[{"$f":"IF(LIST!G135=\"\",\"\",LIST!G135)","v":""},{"$f":"IF(LIST!E135<>\"\",\"人口銘木AL［\"&LIST!E135 &\"] \"&LIST!F135,\"\")","v":""},{"$f":"IF(LIST!G135=\"\",\"\",LIST!K135)","v":""},{"$f":"IF(LIST!O135=\"\",\"\",LIST!O135)","v":""},{"$f":"IF(LIST!H135=\"\",\"\",IF(LIST!I135=0,\"H\"&LIST!J135,\"W\"&LIST!I135&IF(LIST!J135=0,\"\",\" H\"&LIST!J135)))","v":""}]
[{"$f":"IF(LIST!G136=\"\",\"\",LIST!G136)","v":""},{"$f":"IF(LIST!E136<>\"\",\"人口銘木AL［\"&LIST!E136 &\"] \"&LIST!F136,\"\")","v":""},{"$f":"IF(LIST!G136=\"\",\"\",LIST!K136)","v":""},{"$f":"IF(LIST!O136=\"\",\"\",LIST!O136)","v":""},{"$f":"IF(LIST!H136=\"\",\"\",IF(LIST!I136=0,\"H\"&LIST!J136,\"W\"&LIST!I136&IF(LIST!J136=0,\"\",\" H\"&LIST!J136)))","v":""}]
[{"$f":"IF(LIST!G137=\"\",\"\",LIST!G137)","v":""},{"$f":"IF(LIST!E137<>\"\",\"人口銘木AL［\"&LIST!E137 &\"] \"&LIST!F137,\"\")","v":""},{"$f":"IF(LIST!G137=\"\",\"\",LIST!K137)","v":""},{"$f":"IF(LIST!O137=\"\",\"\",LIST!O137)","v":""},{"$f":"IF(LIST!H137=\"\",\"\",IF(LIST!I137=0,\"H\"&LIST!J137,\"W\"&LIST!I137&IF(LIST!J137=0,\"\",\" H\"&LIST!J137)))","v":""}]
[{"$f":"IF(LIST!G138=\"\",\"\",LIST!G138)","v":""},{"$f":"IF(LIST!E138<>\"\",\"人口銘木AL［\"&LIST!E138 &\"] \"&LIST!F138,\"\")","v":""},{"$f":"IF(LIST!G138=\"\",\"\",LIST!K138)","v":""},{"$f":"IF(LIST!O138=\"\",\"\",LIST!O138)","v":""},{"$f":"IF(LIST!H138=\"\",\"\",IF(LIST!I138=0,\"H\"&LIST!J138,\"W\"&LIST!I138&IF(LIST!J138=0,\"\",\" H\"&LIST!J138)))","v":""}]
[{"$f":"IF(LIST!G139=\"\",\"\",LIST!G139)","v":""},{"$f":"IF(LIST!E139<>\"\",\"人口銘木AL［\"&LIST!E139 &\"] \"&LIST!F139,\"\")","v":""},{"$f":"IF(LIST!G139=\"\",\"\",LIST!K139)","v":""},{"$f":"IF(LIST!O139=\"\",\"\",LIST!O139)","v":""},{"$f":"IF(LIST!H139=\"\",\"\",IF(LIST!I139=0,\"H\"&LIST!J139,\"W\"&LIST!I139&IF(LIST!J139=0,\"\",\" H\"&LIST!J139)))","v":""}]
[{"$f":"IF(LIST!G140=\"\",\"\",LIST!G140)","v":""},{"$f":"IF(LIST!E140<>\"\",\"人口銘木AL［\"&LIST!E140 &\"] \"&LIST!F140,\"\")","v":""},{"$f":"IF(LIST!G140=\"\",\"\",LIST!K140)","v":""},{"$f":"IF(LIST!O140=\"\",\"\",LIST!O140)","v":""},{"$f":"IF(LIST!H140=\"\",\"\",IF(LIST!I140=0,\"H\"&LIST!J140,\"W\"&LIST!I140&IF(LIST!J140=0,\"\",\" H\"&LIST!J140)))","v":""}]
[{"$f":"IF(LIST!G141=\"\",\"\",LIST!G141)","v":""},{"$f":"IF(LIST!E141<>\"\",\"人口銘木AL［\"&LIST!E141 &\"] \"&LIST!F141,\"\")","v":""},{"$f":"IF(LIST!G141=\"\",\"\",LIST!K141)","v":""},{"$f":"IF(LIST!O141=\"\",\"\",LIST!O141)","v":""},{"$f":"IF(LIST!H141=\"\",\"\",IF(LIST!I141=0,\"H\"&LIST!J141,\"W\"&LIST!I141&IF(LIST!J141=0,\"\",\" H\"&LIST!J141)))","v":""}]
[{"$f":"IF(LIST!G142=\"\",\"\",LIST!G142)","v":""},{"$f":"IF(LIST!E142<>\"\",\"人口銘木AL［\"&LIST!E142 &\"] \"&LIST!F142,\"\")","v":""},{"$f":"IF(LIST!G142=\"\",\"\",LIST!K142)","v":""},{"$f":"IF(LIST!O142=\"\",\"\",LIST!O142)","v":""},{"$f":"IF(LIST!H142=\"\",\"\",IF(LIST!I142=0,\"H\"&LIST!J142,\"W\"&LIST!I142&IF(LIST!J142=0,\"\",\" H\"&LIST!J142)))","v":""}]
[{"$f":"IF(LIST!G143=\"\",\"\",LIST!G143)","v":""},{"$f":"IF(LIST!E143<>\"\",\"人口銘木AL［\"&LIST!E143 &\"] \"&LIST!F143,\"\")","v":""},{"$f":"IF(LIST!G143=\"\",\"\",LIST!K143)","v":""},{"$f":"IF(LIST!O143=\"\",\"\",LIST!O143)","v":""},{"$f":"IF(LIST!H143=\"\",\"\",IF(LIST!I143=0,\"H\"&LIST!J143,\"W\"&LIST!I143&IF(LIST!J143=0,\"\",\" H\"&LIST!J143)))","v":""}]
[{"$f":"IF(LIST!G144=\"\",\"\",LIST!G144)","v":""},{"$f":"IF(LIST!E144<>\"\",\"人口銘木AL［\"&LIST!E144 &\"] \"&LIST!F144,\"\")","v":""},{"$f":"IF(LIST!G144=\"\",\"\",LIST!K144)","v":""},{"$f":"IF(LIST!O144=\"\",\"\",LIST!O144)","v":""},{"$f":"IF(LIST!H144=\"\",\"\",IF(LIST!I144=0,\"H\"&LIST!J144,\"W\"&LIST!I144&IF(LIST!J144=0,\"\",\" H\"&LIST!J144)))","v":""}]
[{"$f":"IF(LIST!G145=\"\",\"\",LIST!G145)","v":""},{"$f":"IF(LIST!E145<>\"\",\"人口銘木AL［\"&LIST!E145 &\"] \"&LIST!F145,\"\")","v":""},{"$f":"IF(LIST!G145=\"\",\"\",LIST!K145)","v":""},{"$f":"IF(LIST!O145=\"\",\"\",LIST!O145)","v":""},{"$f":"IF(LIST!H145=\"\",\"\",IF(LIST!I145=0,\"H\"&LIST!J145,\"W\"&LIST!I145&IF(LIST!J145=0,\"\",\" H\"&LIST!J145)))","v":""}]
[{"$f":"IF(LIST!G146=\"\",\"\",LIST!G146)","v":""},{"$f":"IF(LIST!E146<>\"\",\"人口銘木AL［\"&LIST!E146 &\"] \"&LIST!F146,\"\")","v":""},{"$f":"IF(LIST!G146=\"\",\"\",LIST!K146)","v":""},{"$f":"IF(LIST!O146=\"\",\"\",LIST!O146)","v":""},{"$f":"IF(LIST!H146=\"\",\"\",IF(LIST!I146=0,\"H\"&LIST!J146,\"W\"&LIST!I146&IF(LIST!J146=0,\"\",\" H\"&LIST!J146)))","v":""}]
[{"$f":"IF(LIST!G147=\"\",\"\",LIST!G147)","v":""},{"$f":"IF(LIST!E147<>\"\",\"人口銘木AL［\"&LIST!E147 &\"] \"&LIST!F147,\"\")","v":""},{"$f":"IF(LIST!G147=\"\",\"\",LIST!K147)","v":""},{"$f":"IF(LIST!O147=\"\",\"\",LIST!O147)","v":""},{"$f":"IF(LIST!H147=\"\",\"\",IF(LIST!I147=0,\"H\"&LIST!J147,\"W\"&LIST!I147&IF(LIST!J147=0,\"\",\" H\"&LIST!J147)))","v":""}]
[{"$f":"IF(LIST!G148=\"\",\"\",LIST!G148)","v":""},{"$f":"IF(LIST!E148<>\"\",\"人口銘木AL［\"&LIST!E148 &\"] \"&LIST!F148,\"\")","v":""},{"$f":"IF(LIST!G148=\"\",\"\",LIST!K148)","v":""},{"$f":"IF(LIST!O148=\"\",\"\",LIST!O148)","v":""},{"$f":"IF(LIST!H148=\"\",\"\",IF(LIST!I148=0,\"H\"&LIST!J148,\"W\"&LIST!I148&IF(LIST!J148=0,\"\",\" H\"&LIST!J148)))","v":""}]
[{"$f":"IF(LIST!G149=\"\",\"\",LIST!G149)","v":""},{"$f":"IF(LIST!E149<>\"\",\"人口銘木AL［\"&LIST!E149 &\"] \"&LIST!F149,\"\")","v":""},{"$f":"IF(LIST!G149=\"\",\"\",LIST!K149)","v":""},{"$f":"IF(LIST!O149=\"\",\"\",LIST!O149)","v":""},{"$f":"IF(LIST!H149=\"\",\"\",IF(LIST!I149=0,\"H\"&LIST!J149,\"W\"&LIST!I149&IF(LIST!J149=0,\"\",\" H\"&LIST!J149)))","v":""}]
[{"$f":"IF(LIST!G150=\"\",\"\",LIST!G150)","v":""},{"$f":"IF(LIST!E150<>\"\",\"人口銘木AL［\"&LIST!E150 &\"] \"&LIST!F150,\"\")","v":""},{"$f":"IF(LIST!G150=\"\",\"\",LIST!K150)","v":""},{"$f":"IF(LIST!O150=\"\",\"\",LIST!O150)","v":""},{"$f":"IF(LIST!H150=\"\",\"\",IF(LIST!I150=0,\"H\"&LIST!J150,\"W\"&LIST!I150&IF(LIST!J150=0,\"\",\" H\"&LIST!J150)))","v":""}]
[{"$f":"IF(LIST!G151=\"\",\"\",LIST!G151)","v":""},{"$f":"IF(LIST!E151<>\"\",\"人口銘木AL［\"&LIST!E151 &\"] \"&LIST!F151,\"\")","v":""},{"$f":"IF(LIST!G151=\"\",\"\",LIST!K151)","v":""},{"$f":"IF(LIST!O151=\"\",\"\",LIST!O151)","v":""},{"$f":"IF(LIST!H151=\"\",\"\",IF(LIST!I151=0,\"H\"&LIST!J151,\"W\"&LIST!I151&IF(LIST!J151=0,\"\",\" H\"&LIST!J151)))","v":""}]
[{"$f":"IF(LIST!G152=\"\",\"\",LIST!G152)","v":""},{"$f":"IF(LIST!E152<>\"\",\"人口銘木AL［\"&LIST!E152 &\"] \"&LIST!F152,\"\")","v":""},{"$f":"IF(LIST!G152=\"\",\"\",LIST!K152)","v":""},{"$f":"IF(LIST!O152=\"\",\"\",LIST!O152)","v":""},{"$f":"IF(LIST!H152=\"\",\"\",IF(LIST!I152=0,\"H\"&LIST!J152,\"W\"&LIST!I152&IF(LIST!J152=0,\"\",\" H\"&LIST!J152)))","v":""}]
[{"$f":"IF(LIST!G153=\"\",\"\",LIST!G153)","v":""},{"$f":"IF(LIST!E153<>\"\",\"人口銘木AL［\"&LIST!E153 &\"] \"&LIST!F153,\"\")","v":""},{"$f":"IF(LIST!G153=\"\",\"\",LIST!K153)","v":""},{"$f":"IF(LIST!O153=\"\",\"\",LIST!O153)","v":""},{"$f":"IF(LIST!H153=\"\",\"\",IF(LIST!I153=0,\"H\"&LIST!J153,\"W\"&LIST!I153&IF(LIST!J153=0,\"\",\" H\"&LIST!J153)))","v":""}]
[{"$f":"IF(LIST!G154=\"\",\"\",LIST!G154)","v":""},{"$f":"IF(LIST!E154<>\"\",\"人口銘木AL［\"&LIST!E154 &\"] \"&LIST!F154,\"\")","v":""},{"$f":"IF(LIST!G154=\"\",\"\",LIST!K154)","v":""},{"$f":"IF(LIST!O154=\"\",\"\",LIST!O154)","v":""},{"$f":"IF(LIST!H154=\"\",\"\",IF(LIST!I154=0,\"H\"&LIST!J154,\"W\"&LIST!I154&IF(LIST!J154=0,\"\",\" H\"&LIST!J154)))","v":""}]
[{"$f":"IF(LIST!G155=\"\",\"\",LIST!G155)","v":""},{"$f":"IF(LIST!E155<>\"\",\"人口銘木AL［\"&LIST!E155 &\"] \"&LIST!F155,\"\")","v":""},{"$f":"IF(LIST!G155=\"\",\"\",LIST!K155)","v":""},{"$f":"IF(LIST!O155=\"\",\"\",LIST!O155)","v":""},{"$f":"IF(LIST!H155=\"\",\"\",IF(LIST!I155=0,\"H\"&LIST!J155,\"W\"&LIST!I155&IF(LIST!J155=0,\"\",\" H\"&LIST!J155)))","v":""}]
[{"$f":"IF(LIST!G156=\"\",\"\",LIST!G156)","v":""},{"$f":"IF(LIST!E156<>\"\",\"人口銘木AL［\"&LIST!E156 &\"] \"&LIST!F156,\"\")","v":""},{"$f":"IF(LIST!G156=\"\",\"\",LIST!K156)","v":""},{"$f":"IF(LIST!O156=\"\",\"\",LIST!O156)","v":""},{"$f":"IF(LIST!H156=\"\",\"\",IF(LIST!I156=0,\"H\"&LIST!J156,\"W\"&LIST!I156&IF(LIST!J156=0,\"\",\" H\"&LIST!J156)))","v":""}]
[{"$f":"IF(LIST!G157=\"\",\"\",LIST!G157)","v":""},{"$f":"IF(LIST!E157<>\"\",\"人口銘木AL［\"&LIST!E157 &\"] \"&LIST!F157,\"\")","v":""},{"$f":"IF(LIST!G157=\"\",\"\",LIST!K157)","v":""},{"$f":"IF(LIST!O157=\"\",\"\",LIST!O157)","v":""},{"$f":"IF(LIST!H157=\"\",\"\",IF(LIST!I157=0,\"H\"&LIST!J157,\"W\"&LIST!I157&IF(LIST!J157=0,\"\",\" H\"&LIST!J157)))","v":""}]
[{"$f":"IF(LIST!G158=\"\",\"\",LIST!G158)","v":""},{"$f":"IF(LIST!E158<>\"\",\"人口銘木AL［\"&LIST!E158 &\"] \"&LIST!F158,\"\")","v":""},{"$f":"IF(LIST!G158=\"\",\"\",LIST!K158)","v":""},{"$f":"IF(LIST!O158=\"\",\"\",LIST!O158)","v":""},{"$f":"IF(LIST!H158=\"\",\"\",IF(LIST!I158=0,\"H\"&LIST!J158,\"W\"&LIST!I158&IF(LIST!J158=0,\"\",\" H\"&LIST!J158)))","v":""}]
[{"$f":"IF(LIST!G159=\"\",\"\",LIST!G159)","v":""},{"$f":"IF(LIST!E159<>\"\",\"人口銘木AL［\"&LIST!E159 &\"] \"&LIST!F159,\"\")","v":""},{"$f":"IF(LIST!G159=\"\",\"\",LIST!K159)","v":""},{"$f":"IF(LIST!O159=\"\",\"\",LIST!O159)","v":""},{"$f":"IF(LIST!H159=\"\",\"\",IF(LIST!I159=0,\"H\"&LIST!J159,\"W\"&LIST!I159&IF(LIST!J159=0,\"\",\" H\"&LIST!J159)))","v":""}]
[{"$f":"IF(LIST!G160=\"\",\"\",LIST!G160)","v":""},{"$f":"IF(LIST!E160<>\"\",\"人口銘木AL［\"&LIST!E160 &\"] \"&LIST!F160,\"\")","v":""},{"$f":"IF(LIST!G160=\"\",\"\",LIST!K160)","v":""},{"$f":"IF(LIST!O160=\"\",\"\",LIST!O160)","v":""},{"$f":"IF(LIST!H160=\"\",\"\",IF(LIST!I160=0,\"H\"&LIST!J160,\"W\"&LIST!I160&IF(LIST!J160=0,\"\",\" H\"&LIST!J160)))","v":""}]
[{"$f":"IF(LIST!G161=\"\",\"\",LIST!G161)","v":""},{"$f":"IF(LIST!E161<>\"\",\"人口銘木AL［\"&LIST!E161 &\"] \"&LIST!F161,\"\")","v":""},{"$f":"IF(LIST!G161=\"\",\"\",LIST!K161)","v":""},{"$f":"IF(LIST!O161=\"\",\"\",LIST!O161)","v":""},{"$f":"IF(LIST!H161=\"\",\"\",IF(LIST!I161=0,\"H\"&LIST!J161,\"W\"&LIST!I161&IF(LIST!J161=0,\"\",\" H\"&LIST!J161)))","v":""}]
[{"$f":"IF(LIST!G162=\"\",\"\",LIST!G162)","v":""},{"$f":"IF(LIST!E162<>\"\",\"人口銘木AL［\"&LIST!E162 &\"] \"&LIST!F162,\"\")","v":""},{"$f":"IF(LIST!G162=\"\",\"\",LIST!K162)","v":""},{"$f":"IF(LIST!O162=\"\",\"\",LIST!O162)","v":""},{"$f":"IF(LIST!H162=\"\",\"\",IF(LIST!I162=0,\"H\"&LIST!J162,\"W\"&LIST!I162&IF(LIST!J162=0,\"\",\" H\"&LIST!J162)))","v":""}]
[{"$f":"IF(LIST!G163=\"\",\"\",LIST!G163)","v":""},{"$f":"IF(LIST!E163<>\"\",\"人口銘木AL［\"&LIST!E163 &\"] \"&LIST!F163,\"\")","v":""},{"$f":"IF(LIST!G163=\"\",\"\",LIST!K163)","v":""},{"$f":"IF(LIST!O163=\"\",\"\",LIST!O163)","v":""},{"$f":"IF(LIST!H163=\"\",\"\",IF(LIST!I163=0,\"H\"&LIST!J163,\"W\"&LIST!I163&IF(LIST!J163=0,\"\",\" H\"&LIST!J163)))","v":""}]
[{"$f":"IF(LIST!G164=\"\",\"\",LIST!G164)","v":""},{"$f":"IF(LIST!E164<>\"\",\"人口銘木AL［\"&LIST!E164 &\"] \"&LIST!F164,\"\")","v":""},{"$f":"IF(LIST!G164=\"\",\"\",LIST!K164)","v":""},{"$f":"IF(LIST!O164=\"\",\"\",LIST!O164)","v":""},{"$f":"IF(LIST!H164=\"\",\"\",IF(LIST!I164=0,\"H\"&LIST!J164,\"W\"&LIST!I164&IF(LIST!J164=0,\"\",\" H\"&LIST!J164)))","v":""}]
[{"$f":"IF(LIST!G165=\"\",\"\",LIST!G165)","v":""},{"$f":"IF(LIST!E165<>\"\",\"人口銘木AL［\"&LIST!E165 &\"] \"&LIST!F165,\"\")","v":""},{"$f":"IF(LIST!G165=\"\",\"\",LIST!K165)","v":""},{"$f":"IF(LIST!O165=\"\",\"\",LIST!O165)","v":""},{"$f":"IF(LIST!H165=\"\",\"\",IF(LIST!I165=0,\"H\"&LIST!J165,\"W\"&LIST!I165&IF(LIST!J165=0,\"\",\" H\"&LIST!J165)))","v":""}]
[{"$f":"IF(LIST!G166=\"\",\"\",LIST!G166)","v":""},{"$f":"IF(LIST!E166<>\"\",\"人口銘木AL［\"&LIST!E166 &\"] \"&LIST!F166,\"\")","v":""},{"$f":"IF(LIST!G166=\"\",\"\",LIST!K166)","v":""},{"$f":"IF(LIST!O166=\"\",\"\",LIST!O166)","v":""},{"$f":"IF(LIST!H166=\"\",\"\",IF(LIST!I166=0,\"H\"&LIST!J166,\"W\"&LIST!I166&IF(LIST!J166=0,\"\",\" H\"&LIST!J166)))","v":""}]
[{"$f":"IF(LIST!G167=\"\",\"\",LIST!G167)","v":""},{"$f":"IF(LIST!E167<>\"\",\"人口銘木AL［\"&LIST!E167 &\"] \"&LIST!F167,\"\")","v":""},{"$f":"IF(LIST!G167=\"\",\"\",LIST!K167)","v":""},{"$f":"IF(LIST!O167=\"\",\"\",LIST!O167)","v":""},{"$f":"IF(LIST!H167=\"\",\"\",IF(LIST!I167=0,\"H\"&LIST!J167,\"W\"&LIST!I167&IF(LIST!J167=0,\"\",\" H\"&LIST!J167)))","v":""}]
[{"$f":"IF(LIST!G168=\"\",\"\",LIST!G168)","v":""},{"$f":"IF(LIST!E168<>\"\",\"人口銘木AL［\"&LIST!E168 &\"] \"&LIST!F168,\"\")","v":""},{"$f":"IF(LIST!G168=\"\",\"\",LIST!K168)","v":""},{"$f":"IF(LIST!O168=\"\",\"\",LIST!O168)","v":""},{"$f":"IF(LIST!H168=\"\",\"\",IF(LIST!I168=0,\"H\"&LIST!J168,\"W\"&LIST!I168&IF(LIST!J168=0,\"\",\" H\"&LIST!J168)))","v":""}]
[{"$f":"IF(LIST!G169=\"\",\"\",LIST!G169)","v":""},{"$f":"IF(LIST!E169<>\"\",\"人口銘木AL［\"&LIST!E169 &\"] \"&LIST!F169,\"\")","v":""},{"$f":"IF(LIST!G169=\"\",\"\",LIST!K169)","v":""},{"$f":"IF(LIST!O169=\"\",\"\",LIST!O169)","v":""},{"$f":"IF(LIST!H169=\"\",\"\",IF(LIST!I169=0,\"H\"&LIST!J169,\"W\"&LIST!I169&IF(LIST!J169=0,\"\",\" H\"&LIST!J169)))","v":""}]
[{"$f":"IF(LIST!G170=\"\",\"\",LIST!G170)","v":""},{"$f":"IF(LIST!E170<>\"\",\"人口銘木AL［\"&LIST!E170 &\"] \"&LIST!F170,\"\")","v":""},{"$f":"IF(LIST!G170=\"\",\"\",LIST!K170)","v":""},{"$f":"IF(LIST!O170=\"\",\"\",LIST!O170)","v":""},{"$f":"IF(LIST!H170=\"\",\"\",IF(LIST!I170=0,\"H\"&LIST!J170,\"W\"&LIST!I170&IF(LIST!J170=0,\"\",\" H\"&LIST!J170)))","v":""}]
[{"$f":"IF(LIST!G171=\"\",\"\",LIST!G171)","v":""},{"$f":"IF(LIST!E171<>\"\",\"人口銘木AL［\"&LIST!E171 &\"] \"&LIST!F171,\"\")","v":""},{"$f":"IF(LIST!G171=\"\",\"\",LIST!K171)","v":""},{"$f":"IF(LIST!O171=\"\",\"\",LIST!O171)","v":""},{"$f":"IF(LIST!H171=\"\",\"\",IF(LIST!I171=0,\"H\"&LIST!J171,\"W\"&LIST!I171&IF(LIST!J171=0,\"\",\" H\"&LIST!J171)))","v":""}]
[{"$f":"IF(LIST!G172=\"\",\"\",LIST!G172)","v":""},{"$f":"IF(LIST!E172<>\"\",\"人口銘木AL［\"&LIST!E172 &\"] \"&LIST!F172,\"\")","v":""},{"$f":"IF(LIST!G172=\"\",\"\",LIST!K172)","v":""},{"$f":"IF(LIST!O172=\"\",\"\",LIST!O172)","v":""},{"$f":"IF(LIST!H172=\"\",\"\",IF(LIST!I172=0,\"H\"&LIST!J172,\"W\"&LIST!I172&IF(LIST!J172=0,\"\",\" H\"&LIST!J172)))","v":""}]
[{"$f":"IF(LIST!G173=\"\",\"\",LIST!G173)","v":""},{"$f":"IF(LIST!E173<>\"\",\"人口銘木AL［\"&LIST!E173 &\"] \"&LIST!F173,\"\")","v":""},{"$f":"IF(LIST!G173=\"\",\"\",LIST!K173)","v":""},{"$f":"IF(LIST!O173=\"\",\"\",LIST!O173)","v":""},{"$f":"IF(LIST!H173=\"\",\"\",IF(LIST!I173=0,\"H\"&LIST!J173,\"W\"&LIST!I173&IF(LIST!J173=0,\"\",\" H\"&LIST!J173)))","v":""}]
[{"$f":"IF(LIST!G174=\"\",\"\",LIST!G174)","v":""},{"$f":"IF(LIST!E174<>\"\",\"人口銘木AL［\"&LIST!E174 &\"] \"&LIST!F174,\"\")","v":""},{"$f":"IF(LIST!G174=\"\",\"\",LIST!K174)","v":""},{"$f":"IF(LIST!O174=\"\",\"\",LIST!O174)","v":""},{"$f":"IF(LIST!H174=\"\",\"\",IF(LIST!I174=0,\"H\"&LIST!J174,\"W\"&LIST!I174&IF(LIST!J174=0,\"\",\" H\"&LIST!J174)))","v":""}]
[{"$f":"IF(LIST!G175=\"\",\"\",LIST!G175)","v":""},{"$f":"IF(LIST!E175<>\"\",\"人口銘木AL［\"&LIST!E175 &\"] \"&LIST!F175,\"\")","v":""},{"$f":"IF(LIST!G175=\"\",\"\",LIST!K175)","v":""},{"$f":"IF(LIST!O175=\"\",\"\",LIST!O175)","v":""},{"$f":"IF(LIST!H175=\"\",\"\",IF(LIST!I175=0,\"H\"&LIST!J175,\"W\"&LIST!I175&IF(LIST!J175=0,\"\",\" H\"&LIST!J175)))","v":""}]
[{"$f":"IF(LIST!G176=\"\",\"\",LIST!G176)","v":""},{"$f":"IF(LIST!E176<>\"\",\"人口銘木AL［\"&LIST!E176 &\"] \"&LIST!F176,\"\")","v":""},{"$f":"IF(LIST!G176=\"\",\"\",LIST!K176)","v":""},{"$f":"IF(LIST!O176=\"\",\"\",LIST!O176)","v":""},{"$f":"IF(LIST!H176=\"\",\"\",IF(LIST!I176=0,\"H\"&LIST!J176,\"W\"&LIST!I176&IF(LIST!J176=0,\"\",\" H\"&LIST!J176)))","v":""}]
[{"$f":"IF(LIST!G177=\"\",\"\",LIST!G177)","v":""},{"$f":"IF(LIST!E177<>\"\",\"人口銘木AL［\"&LIST!E177 &\"] \"&LIST!F177,\"\")","v":""},{"$f":"IF(LIST!G177=\"\",\"\",LIST!K177)","v":""},{"$f":"IF(LIST!O177=\"\",\"\",LIST!O177)","v":""},{"$f":"IF(LIST!H177=\"\",\"\",IF(LIST!I177=0,\"H\"&LIST!J177,\"W\"&LIST!I177&IF(LIST!J177=0,\"\",\" H\"&LIST!J177)))","v":""}]
[{"$f":"IF(LIST!G178=\"\",\"\",LIST!G178)","v":""},{"$f":"IF(LIST!E178<>\"\",\"人口銘木AL［\"&LIST!E178 &\"] \"&LIST!F178,\"\")","v":""},{"$f":"IF(LIST!G178=\"\",\"\",LIST!K178)","v":""},{"$f":"IF(LIST!O178=\"\",\"\",LIST!O178)","v":""},{"$f":"IF(LIST!H178=\"\",\"\",IF(LIST!I178=0,\"H\"&LIST!J178,\"W\"&LIST!I178&IF(LIST!J178=0,\"\",\" H\"&LIST!J178)))","v":""}]
[{"$f":"IF(LIST!G179=\"\",\"\",LIST!G179)","v":""},{"$f":"IF(LIST!E179<>\"\",\"人口銘木AL［\"&LIST!E179 &\"] \"&LIST!F179,\"\")","v":""},{"$f":"IF(LIST!G179=\"\",\"\",LIST!K179)","v":""},{"$f":"IF(LIST!O179=\"\",\"\",LIST!O179)","v":""},{"$f":"IF(LIST!H179=\"\",\"\",IF(LIST!I179=0,\"H\"&LIST!J179,\"W\"&LIST!I179&IF(LIST!J179=0,\"\",\" H\"&LIST!J179)))","v":""}]
[{"$f":"IF(LIST!G180=\"\",\"\",LIST!G180)","v":""},{"$f":"IF(LIST!E180<>\"\",\"人口銘木AL［\"&LIST!E180 &\"] \"&LIST!F180,\"\")","v":""},{"$f":"IF(LIST!G180=\"\",\"\",LIST!K180)","v":""},{"$f":"IF(LIST!O180=\"\",\"\",LIST!O180)","v":""},{"$f":"IF(LIST!H180=\"\",\"\",IF(LIST!I180=0,\"H\"&LIST!J180,\"W\"&LIST!I180&IF(LIST!J180=0,\"\",\" H\"&LIST!J180)))","v":""}]
[{"$f":"IF(LIST!G181=\"\",\"\",LIST!G181)","v":""},{"$f":"IF(LIST!E181<>\"\",\"人口銘木AL［\"&LIST!E181 &\"] \"&LIST!F181,\"\")","v":""},{"$f":"IF(LIST!G181=\"\",\"\",LIST!K181)","v":""},{"$f":"IF(LIST!O181=\"\",\"\",LIST!O181)","v":""},{"$f":"IF(LIST!H181=\"\",\"\",IF(LIST!I181=0,\"H\"&LIST!J181,\"W\"&LIST!I181&IF(LIST!J181=0,\"\",\" H\"&LIST!J181)))","v":""}]
[{"$f":"IF(LIST!G182=\"\",\"\",LIST!G182)","v":""},{"$f":"IF(LIST!E182<>\"\",\"人口銘木AL［\"&LIST!E182 &\"] \"&LIST!F182,\"\")","v":""},{"$f":"IF(LIST!G182=\"\",\"\",LIST!K182)","v":""},{"$f":"IF(LIST!O182=\"\",\"\",LIST!O182)","v":""},{"$f":"IF(LIST!H182=\"\",\"\",IF(LIST!I182=0,\"H\"&LIST!J182,\"W\"&LIST!I182&IF(LIST!J182=0,\"\",\" H\"&LIST!J182)))","v":""}]
[{"$f":"IF(LIST!G183=\"\",\"\",LIST!G183)","v":""},{"$f":"IF(LIST!E183<>\"\",\"人口銘木AL［\"&LIST!E183 &\"] \"&LIST!F183,\"\")","v":""},{"$f":"IF(LIST!G183=\"\",\"\",LIST!K183)","v":""},{"$f":"IF(LIST!O183=\"\",\"\",LIST!O183)","v":""},{"$f":"IF(LIST!H183=\"\",\"\",IF(LIST!I183=0,\"H\"&LIST!J183,\"W\"&LIST!I183&IF(LIST!J183=0,\"\",\" H\"&LIST!J183)))","v":""}]
[{"$f":"IF(LIST!G184=\"\",\"\",LIST!G184)","v":""},{"$f":"IF(LIST!E184<>\"\",\"人口銘木AL［\"&LIST!E184 &\"] \"&LIST!F184,\"\")","v":""},{"$f":"IF(LIST!G184=\"\",\"\",LIST!K184)","v":""},{"$f":"IF(LIST!O184=\"\",\"\",LIST!O184)","v":""},{"$f":"IF(LIST!H184=\"\",\"\",IF(LIST!I184=0,\"H\"&LIST!J184,\"W\"&LIST!I184&IF(LIST!J184=0,\"\",\" H\"&LIST!J184)))","v":""}]
[{"$f":"IF(LIST!G185=\"\",\"\",LIST!G185)","v":""},{"$f":"IF(LIST!E185<>\"\",\"人口銘木AL［\"&LIST!E185 &\"] \"&LIST!F185,\"\")","v":""},{"$f":"IF(LIST!G185=\"\",\"\",LIST!K185)","v":""},{"$f":"IF(LIST!O185=\"\",\"\",LIST!O185)","v":""},{"$f":"IF(LIST!H185=\"\",\"\",IF(LIST!I185=0,\"H\"&LIST!J185,\"W\"&LIST!I185&IF(LIST!J185=0,\"\",\" H\"&LIST!J185)))","v":""}]
[{"$f":"IF(LIST!G186=\"\",\"\",LIST!G186)","v":""},{"$f":"IF(LIST!E186<>\"\",\"人口銘木AL［\"&LIST!E186 &\"] \"&LIST!F186,\"\")","v":""},{"$f":"IF(LIST!G186=\"\",\"\",LIST!K186)","v":""},{"$f":"IF(LIST!O186=\"\",\"\",LIST!O186)","v":""},{"$f":"IF(LIST!H186=\"\",\"\",IF(LIST!I186=0,\"H\"&LIST!J186,\"W\"&LIST!I186&IF(LIST!J186=0,\"\",\" H\"&LIST!J186)))","v":""}]
[{"$f":"IF(LIST!G187=\"\",\"\",LIST!G187)","v":""},{"$f":"IF(LIST!E187<>\"\",\"人口銘木AL［\"&LIST!E187 &\"] \"&LIST!F187,\"\")","v":""},{"$f":"IF(LIST!G187=\"\",\"\",LIST!K187)","v":""},{"$f":"IF(LIST!O187=\"\",\"\",LIST!O187)","v":""},{"$f":"IF(LIST!H187=\"\",\"\",IF(LIST!I187=0,\"H\"&LIST!J187,\"W\"&LIST!I187&IF(LIST!J187=0,\"\",\" H\"&LIST!J187)))","v":""}]
[{"$f":"IF(LIST!G188=\"\",\"\",LIST!G188)","v":""},{"$f":"IF(LIST!E188<>\"\",\"人口銘木AL［\"&LIST!E188 &\"] \"&LIST!F188,\"\")","v":""},{"$f":"IF(LIST!G188=\"\",\"\",LIST!K188)","v":""},{"$f":"IF(LIST!O188=\"\",\"\",LIST!O188)","v":""},{"$f":"IF(LIST!H188=\"\",\"\",IF(LIST!I188=0,\"H\"&LIST!J188,\"W\"&LIST!I188&IF(LIST!J188=0,\"\",\" H\"&LIST!J188)))","v":""}]
[{"$f":"IF(LIST!G189=\"\",\"\",LIST!G189)","v":""},{"$f":"IF(LIST!E189<>\"\",\"人口銘木AL［\"&LIST!E189 &\"] \"&LIST!F189,\"\")","v":""},{"$f":"IF(LIST!G189=\"\",\"\",LIST!K189)","v":""},{"$f":"IF(LIST!O189=\"\",\"\",LIST!O189)","v":""},{"$f":"IF(LIST!H189=\"\",\"\",IF(LIST!I189=0,\"H\"&LIST!J189,\"W\"&LIST!I189&IF(LIST!J189=0,\"\",\" H\"&LIST!J189)))","v":""}]
[{"$f":"IF(LIST!G190=\"\",\"\",LIST!G190)","v":""},{"$f":"IF(LIST!E190<>\"\",\"人口銘木AL［\"&LIST!E190 &\"] \"&LIST!F190,\"\")","v":""},{"$f":"IF(LIST!G190=\"\",\"\",LIST!K190)","v":""},{"$f":"IF(LIST!O190=\"\",\"\",LIST!O190)","v":""},{"$f":"IF(LIST!H190=\"\",\"\",IF(LIST!I190=0,\"H\"&LIST!J190,\"W\"&LIST!I190&IF(LIST!J190=0,\"\",\" H\"&LIST!J190)))","v":""}]
[{"$f":"IF(LIST!G191=\"\",\"\",LIST!G191)","v":""},{"$f":"IF(LIST!E191<>\"\",\"人口銘木AL［\"&LIST!E191 &\"] \"&LIST!F191,\"\")","v":""},{"$f":"IF(LIST!G191=\"\",\"\",LIST!K191)","v":""},{"$f":"IF(LIST!O191=\"\",\"\",LIST!O191)","v":""},{"$f":"IF(LIST!H191=\"\",\"\",IF(LIST!I191=0,\"H\"&LIST!J191,\"W\"&LIST!I191&IF(LIST!J191=0,\"\",\" H\"&LIST!J191)))","v":""}]
[{"$f":"IF(LIST!G192=\"\",\"\",LIST!G192)","v":""},{"$f":"IF(LIST!E192<>\"\",\"人口銘木AL［\"&LIST!E192 &\"] \"&LIST!F192,\"\")","v":""},{"$f":"IF(LIST!G192=\"\",\"\",LIST!K192)","v":""},{"$f":"IF(LIST!O192=\"\",\"\",LIST!O192)","v":""},{"$f":"IF(LIST!H192=\"\",\"\",IF(LIST!I192=0,\"H\"&LIST!J192,\"W\"&LIST!I192&IF(LIST!J192=0,\"\",\" H\"&LIST!J192)))","v":""}]
[{"$f":"IF(LIST!G193=\"\",\"\",LIST!G193)","v":""},{"$f":"IF(LIST!E193<>\"\",\"人口銘木AL［\"&LIST!E193 &\"] \"&LIST!F193,\"\")","v":""},{"$f":"IF(LIST!G193=\"\",\"\",LIST!K193)","v":""},{"$f":"IF(LIST!O193=\"\",\"\",LIST!O193)","v":""},{"$f":"IF(LIST!H193=\"\",\"\",IF(LIST!I193=0,\"H\"&LIST!J193,\"W\"&LIST!I193&IF(LIST!J193=0,\"\",\" H\"&LIST!J193)))","v":""}]
[{"$f":"IF(LIST!G194=\"\",\"\",LIST!G194)","v":""},{"$f":"IF(LIST!E194<>\"\",\"人口銘木AL［\"&LIST!E194 &\"] \"&LIST!F194,\"\")","v":""},{"$f":"IF(LIST!G194=\"\",\"\",LIST!K194)","v":""},{"$f":"IF(LIST!O194=\"\",\"\",LIST!O194)","v":""},{"$f":"IF(LIST!H194=\"\",\"\",IF(LIST!I194=0,\"H\"&LIST!J194,\"W\"&LIST!I194&IF(LIST!J194=0,\"\",\" H\"&LIST!J194)))","v":""}]
[{"$f":"IF(LIST!G195=\"\",\"\",LIST!G195)","v":""},{"$f":"IF(LIST!E195<>\"\",\"人口銘木AL［\"&LIST!E195 &\"] \"&LIST!F195,\"\")","v":""},{"$f":"IF(LIST!G195=\"\",\"\",LIST!K195)","v":""},{"$f":"IF(LIST!O195=\"\",\"\",LIST!O195)","v":""},{"$f":"IF(LIST!H195=\"\",\"\",IF(LIST!I195=0,\"H\"&LIST!J195,\"W\"&LIST!I195&IF(LIST!J195=0,\"\",\" H\"&LIST!J195)))","v":""}]
[{"$f":"IF(LIST!G196=\"\",\"\",LIST!G196)","v":""},{"$f":"IF(LIST!E196<>\"\",\"人口銘木AL［\"&LIST!E196 &\"] \"&LIST!F196,\"\")","v":""},{"$f":"IF(LIST!G196=\"\",\"\",LIST!K196)","v":""},{"$f":"IF(LIST!O196=\"\",\"\",LIST!O196)","v":""},{"$f":"IF(LIST!H196=\"\",\"\",IF(LIST!I196=0,\"H\"&LIST!J196,\"W\"&LIST!I196&IF(LIST!J196=0,\"\",\" H\"&LIST!J196)))","v":""}]
[{"$f":"IF(LIST!G197=\"\",\"\",LIST!G197)","v":""},{"$f":"IF(LIST!E197<>\"\",\"人口銘木AL［\"&LIST!E197 &\"] \"&LIST!F197,\"\")","v":""},{"$f":"IF(LIST!G197=\"\",\"\",LIST!K197)","v":""},{"$f":"IF(LIST!O197=\"\",\"\",LIST!O197)","v":""},{"$f":"IF(LIST!H197=\"\",\"\",IF(LIST!I197=0,\"H\"&LIST!J197,\"W\"&LIST!I197&IF(LIST!J197=0,\"\",\" H\"&LIST!J197)))","v":""}]
[{"$f":"IF(LIST!G198=\"\",\"\",LIST!G198)","v":""},{"$f":"IF(LIST!E198<>\"\",\"人口銘木AL［\"&LIST!E198 &\"] \"&LIST!F198,\"\")","v":""},{"$f":"IF(LIST!G198=\"\",\"\",LIST!K198)","v":""},{"$f":"IF(LIST!O198=\"\",\"\",LIST!O198)","v":""},{"$f":"IF(LIST!H198=\"\",\"\",IF(LIST!I198=0,\"H\"&LIST!J198,\"W\"&LIST!I198&IF(LIST!J198=0,\"\",\" H\"&LIST!J198)))","v":""}]
[{"$f":"IF(LIST!G199=\"\",\"\",LIST!G199)","v":""},{"$f":"IF(LIST!E199<>\"\",\"人口銘木AL［\"&LIST!E199 &\"] \"&LIST!F199,\"\")","v":""},{"$f":"IF(LIST!G199=\"\",\"\",LIST!K199)","v":""},{"$f":"IF(LIST!O199=\"\",\"\",LIST!O199)","v":""},{"$f":"IF(LIST!H199=\"\",\"\",IF(LIST!I199=0,\"H\"&LIST!J199,\"W\"&LIST!I199&IF(LIST!J199=0,\"\",\" H\"&LIST!J199)))","v":""}]
[{"$f":"IF(LIST!G200=\"\",\"\",LIST!G200)","v":""},{"$f":"IF(LIST!E200<>\"\",\"人口銘木AL［\"&LIST!E200 &\"] \"&LIST!F200,\"\")","v":""},{"$f":"IF(LIST!G200=\"\",\"\",LIST!K200)","v":""},{"$f":"IF(LIST!O200=\"\",\"\",LIST!O200)","v":""},{"$f":"IF(LIST!H200=\"\",\"\",IF(LIST!I200=0,\"H\"&LIST!J200,\"W\"&LIST!I200&IF(LIST!J200=0,\"\",\" H\"&LIST!J200)))","v":""}]
[{"$f":"IF(LIST!G201=\"\",\"\",LIST!G201)","v":""},{"$f":"IF(LIST!E201<>\"\",\"人口銘木AL［\"&LIST!E201 &\"] \"&LIST!F201,\"\")","v":""},{"$f":"IF(LIST!G201=\"\",\"\",LIST!K201)","v":""},{"$f":"IF(LIST!O201=\"\",\"\",LIST!O201)","v":""},{"$f":"IF(LIST!H201=\"\",\"\",IF(LIST!I201=0,\"H\"&LIST!J201,\"W\"&LIST!I201&IF(LIST!J201=0,\"\",\" H\"&LIST!J201)))","v":""}]
[{"$f":"IF(LIST!G202=\"\",\"\",LIST!G202)","v":""},{"$f":"IF(LIST!E202<>\"\",\"人口銘木AL［\"&LIST!E202 &\"] \"&LIST!F202,\"\")","v":""},{"$f":"IF(LIST!G202=\"\",\"\",LIST!K202)","v":""},{"$f":"IF(LIST!O202=\"\",\"\",LIST!O202)","v":""},{"$f":"IF(LIST!H202=\"\",\"\",IF(LIST!I202=0,\"H\"&LIST!J202,\"W\"&LIST!I202&IF(LIST!J202=0,\"\",\" H\"&LIST!J202)))","v":""}]
[{"$f":"IF(LIST!G203=\"\",\"\",LIST!G203)","v":""},{"$f":"IF(LIST!E203<>\"\",\"人口銘木AL［\"&LIST!E203 &\"] \"&LIST!F203,\"\")","v":""},{"$f":"IF(LIST!G203=\"\",\"\",LIST!K203)","v":""},{"$f":"IF(LIST!O203=\"\",\"\",LIST!O203)","v":""},{"$f":"IF(LIST!H203=\"\",\"\",IF(LIST!I203=0,\"H\"&LIST!J203,\"W\"&LIST!I203&IF(LIST!J203=0,\"\",\" H\"&LIST!J203)))","v":""}]
[{"$f":"IF(LIST!G204=\"\",\"\",LIST!G204)","v":""},{"$f":"IF(LIST!E204<>\"\",\"人口銘木AL［\"&LIST!E204 &\"] \"&LIST!F204,\"\")","v":""},{"$f":"IF(LIST!G204=\"\",\"\",LIST!K204)","v":""},{"$f":"IF(LIST!O204=\"\",\"\",LIST!O204)","v":""},{"$f":"IF(LIST!H204=\"\",\"\",IF(LIST!I204=0,\"H\"&LIST!J204,\"W\"&LIST!I204&IF(LIST!J204=0,\"\",\" H\"&LIST!J204)))","v":""}]
[{"$f":"IF(LIST!G205=\"\",\"\",LIST!G205)","v":""},{"$f":"IF(LIST!E205<>\"\",\"人口銘木AL［\"&LIST!E205 &\"] \"&LIST!F205,\"\")","v":""},{"$f":"IF(LIST!G205=\"\",\"\",LIST!K205)","v":""},{"$f":"IF(LIST!O205=\"\",\"\",LIST!O205)","v":""},{"$f":"IF(LIST!H205=\"\",\"\",IF(LIST!I205=0,\"H\"&LIST!J205,\"W\"&LIST!I205&IF(LIST!J205=0,\"\",\" H\"&LIST!J205)))","v":""}]
[{"$f":"IF(LIST!G206=\"\",\"\",LIST!G206)","v":""},{"$f":"IF(LIST!E206<>\"\",\"人口銘木AL［\"&LIST!E206 &\"] \"&LIST!F206,\"\")","v":""},{"$f":"IF(LIST!G206=\"\",\"\",LIST!K206)","v":""},{"$f":"IF(LIST!O206=\"\",\"\",LIST!O206)","v":""},{"$f":"IF(LIST!H206=\"\",\"\",IF(LIST!I206=0,\"H\"&LIST!J206,\"W\"&LIST!I206&IF(LIST!J206=0,\"\",\" H\"&LIST!J206)))","v":""}]
[{"$f":"IF(LIST!G207=\"\",\"\",LIST!G207)","v":""},{"$f":"IF(LIST!E207<>\"\",\"人口銘木AL［\"&LIST!E207 &\"] \"&LIST!F207,\"\")","v":""},{"$f":"IF(LIST!G207=\"\",\"\",LIST!K207)","v":""},{"$f":"IF(LIST!O207=\"\",\"\",LIST!O207)","v":""},{"$f":"IF(LIST!H207=\"\",\"\",IF(LIST!I207=0,\"H\"&LIST!J207,\"W\"&LIST!I207&IF(LIST!J207=0,\"\",\" H\"&LIST!J207)))","v":""}]
[{"$f":"IF(LIST!G208=\"\",\"\",LIST!G208)","v":""},{"$f":"IF(LIST!E208<>\"\",\"人口銘木AL［\"&LIST!E208 &\"] \"&LIST!F208,\"\")","v":""},{"$f":"IF(LIST!G208=\"\",\"\",LIST!K208)","v":""},{"$f":"IF(LIST!O208=\"\",\"\",LIST!O208)","v":""},{"$f":"IF(LIST!H208=\"\",\"\",IF(LIST!I208=0,\"H\"&LIST!J208,\"W\"&LIST!I208&IF(LIST!J208=0,\"\",\" H\"&LIST!J208)))","v":""}]
[{"$f":"IF(LIST!G209=\"\",\"\",LIST!G209)","v":""},{"$f":"IF(LIST!E209<>\"\",\"人口銘木AL［\"&LIST!E209 &\"] \"&LIST!F209,\"\")","v":""},{"$f":"IF(LIST!G209=\"\",\"\",LIST!K209)","v":""},{"$f":"IF(LIST!O209=\"\",\"\",LIST!O209)","v":""},{"$f":"IF(LIST!H209=\"\",\"\",IF(LIST!I209=0,\"H\"&LIST!J209,\"W\"&LIST!I209&IF(LIST!J209=0,\"\",\" H\"&LIST!J209)))","v":""}]
[{"$f":"IF(LIST!G210=\"\",\"\",LIST!G210)","v":""},{"$f":"IF(LIST!E210<>\"\",\"人口銘木AL［\"&LIST!E210 &\"] \"&LIST!F210,\"\")","v":""},{"$f":"IF(LIST!G210=\"\",\"\",LIST!K210)","v":""},{"$f":"IF(LIST!O210=\"\",\"\",LIST!O210)","v":""},{"$f":"IF(LIST!H210=\"\",\"\",IF(LIST!I210=0,\"H\"&LIST!J210,\"W\"&LIST!I210&IF(LIST!J210=0,\"\",\" H\"&LIST!J210)))","v":""}]
[{"$f":"IF(LIST!G211=\"\",\"\",LIST!G211)","v":""},{"$f":"IF(LIST!E211<>\"\",\"人口銘木AL［\"&LIST!E211 &\"] \"&LIST!F211,\"\")","v":""},{"$f":"IF(LIST!G211=\"\",\"\",LIST!K211)","v":""},{"$f":"IF(LIST!O211=\"\",\"\",LIST!O211)","v":""},{"$f":"IF(LIST!H211=\"\",\"\",IF(LIST!I211=0,\"H\"&LIST!J211,\"W\"&LIST!I211&IF(LIST!J211=0,\"\",\" H\"&LIST!J211)))","v":""}]
[{"$f":"IF(LIST!G212=\"\",\"\",LIST!G212)","v":""},{"$f":"IF(LIST!E212<>\"\",\"人口銘木AL［\"&LIST!E212 &\"] \"&LIST!F212,\"\")","v":""},{"$f":"IF(LIST!G212=\"\",\"\",LIST!K212)","v":""},{"$f":"IF(LIST!O212=\"\",\"\",LIST!O212)","v":""},{"$f":"IF(LIST!H212=\"\",\"\",IF(LIST!I212=0,\"H\"&LIST!J212,\"W\"&LIST!I212&IF(LIST!J212=0,\"\",\" H\"&LIST!J212)))","v":""}]
[{"$f":"IF(LIST!G213=\"\",\"\",LIST!G213)","v":""},{"$f":"IF(LIST!E213<>\"\",\"人口銘木AL［\"&LIST!E213 &\"] \"&LIST!F213,\"\")","v":""},{"$f":"IF(LIST!G213=\"\",\"\",LIST!K213)","v":""},{"$f":"IF(LIST!O213=\"\",\"\",LIST!O213)","v":""},{"$f":"IF(LIST!H213=\"\",\"\",IF(LIST!I213=0,\"H\"&LIST!J213,\"W\"&LIST!I213&IF(LIST!J213=0,\"\",\" H\"&LIST!J213)))","v":""}]
[{"$f":"IF(LIST!G214=\"\",\"\",LIST!G214)","v":""},{"$f":"IF(LIST!E214<>\"\",\"人口銘木AL［\"&LIST!E214 &\"] \"&LIST!F214,\"\")","v":""},{"$f":"IF(LIST!G214=\"\",\"\",LIST!K214)","v":""},{"$f":"IF(LIST!O214=\"\",\"\",LIST!O214)","v":""},{"$f":"IF(LIST!H214=\"\",\"\",IF(LIST!I214=0,\"H\"&LIST!J214,\"W\"&LIST!I214&IF(LIST!J214=0,\"\",\" H\"&LIST!J214)))","v":""}]
[{"$f":"IF(LIST!G215=\"\",\"\",LIST!G215)","v":""},{"$f":"IF(LIST!E215<>\"\",\"人口銘木AL［\"&LIST!E215 &\"] \"&LIST!F215,\"\")","v":""},{"$f":"IF(LIST!G215=\"\",\"\",LIST!K215)","v":""},{"$f":"IF(LIST!O215=\"\",\"\",LIST!O215)","v":""},{"$f":"IF(LIST!H215=\"\",\"\",IF(LIST!I215=0,\"H\"&LIST!J215,\"W\"&LIST!I215&IF(LIST!J215=0,\"\",\" H\"&LIST!J215)))","v":""}]
[{"$f":"IF(LIST!G216=\"\",\"\",LIST!G216)","v":""},{"$f":"IF(LIST!E216<>\"\",\"人口銘木AL［\"&LIST!E216 &\"] \"&LIST!F216,\"\")","v":""},{"$f":"IF(LIST!G216=\"\",\"\",LIST!K216)","v":""},{"$f":"IF(LIST!O216=\"\",\"\",LIST!O216)","v":""},{"$f":"IF(LIST!H216=\"\",\"\",IF(LIST!I216=0,\"H\"&LIST!J216,\"W\"&LIST!I216&IF(LIST!J216=0,\"\",\" H\"&LIST!J216)))","v":""}]
[{"$f":"IF(LIST!G217=\"\",\"\",LIST!G217)","v":""},{"$f":"IF(LIST!E217<>\"\",\"人口銘木AL［\"&LIST!E217 &\"] \"&LIST!F217,\"\")","v":""},{"$f":"IF(LIST!G217=\"\",\"\",LIST!K217)","v":""},{"$f":"IF(LIST!O217=\"\",\"\",LIST!O217)","v":""},{"$f":"IF(LIST!H217=\"\",\"\",IF(LIST!I217=0,\"H\"&LIST!J217,\"W\"&LIST!I217&IF(LIST!J217=0,\"\",\" H\"&LIST!J217)))","v":""}]
[{"$f":"IF(LIST!G218=\"\",\"\",LIST!G218)","v":""},{"$f":"IF(LIST!E218<>\"\",\"人口銘木AL［\"&LIST!E218 &\"] \"&LIST!F218,\"\")","v":""},{"$f":"IF(LIST!G218=\"\",\"\",LIST!K218)","v":""},{"$f":"IF(LIST!O218=\"\",\"\",LIST!O218)","v":""},{"$f":"IF(LIST!H218=\"\",\"\",IF(LIST!I218=0,\"H\"&LIST!J218,\"W\"&LIST!I218&IF(LIST!J218=0,\"\",\" H\"&LIST!J218)))","v":""}]
[{"$f":"IF(LIST!G219=\"\",\"\",LIST!G219)","v":""},{"$f":"IF(LIST!E219<>\"\",\"人口銘木AL［\"&LIST!E219 &\"] \"&LIST!F219,\"\")","v":""},{"$f":"IF(LIST!G219=\"\",\"\",LIST!K219)","v":""},{"$f":"IF(LIST!O219=\"\",\"\",LIST!O219)","v":""},{"$f":"IF(LIST!H219=\"\",\"\",IF(LIST!I219=0,\"H\"&LIST!J219,\"W\"&LIST!I219&IF(LIST!J219=0,\"\",\" H\"&LIST!J219)))","v":""}]
[{"$f":"IF(LIST!G220=\"\",\"\",LIST!G220)","v":""},{"$f":"IF(LIST!E220<>\"\",\"人口銘木AL［\"&LIST!E220 &\"] \"&LIST!F220,\"\")","v":""},{"$f":"IF(LIST!G220=\"\",\"\",LIST!K220)","v":""},{"$f":"IF(LIST!O220=\"\",\"\",LIST!O220)","v":""},{"$f":"IF(LIST!H220=\"\",\"\",IF(LIST!I220=0,\"H\"&LIST!J220,\"W\"&LIST!I220&IF(LIST!J220=0,\"\",\" H\"&LIST!J220)))","v":""}]
[{"$f":"IF(LIST!G221=\"\",\"\",LIST!G221)","v":""},{"$f":"IF(LIST!E221<>\"\",\"人口銘木AL［\"&LIST!E221 &\"] \"&LIST!F221,\"\")","v":""},{"$f":"IF(LIST!G221=\"\",\"\",LIST!K221)","v":""},{"$f":"IF(LIST!O221=\"\",\"\",LIST!O221)","v":""},{"$f":"IF(LIST!H221=\"\",\"\",IF(LIST!I221=0,\"H\"&LIST!J221,\"W\"&LIST!I221&IF(LIST!J221=0,\"\",\" H\"&LIST!J221)))","v":""}]
[{"$f":"IF(LIST!G222=\"\",\"\",LIST!G222)","v":""},{"$f":"IF(LIST!E222<>\"\",\"人口銘木AL［\"&LIST!E222 &\"] \"&LIST!F222,\"\")","v":""},{"$f":"IF(LIST!G222=\"\",\"\",LIST!K222)","v":""},{"$f":"IF(LIST!O222=\"\",\"\",LIST!O222)","v":""},{"$f":"IF(LIST!H222=\"\",\"\",IF(LIST!I222=0,\"H\"&LIST!J222,\"W\"&LIST!I222&IF(LIST!J222=0,\"\",\" H\"&LIST!J222)))","v":""}]
[{"$f":"IF(LIST!G223=\"\",\"\",LIST!G223)","v":""},{"$f":"IF(LIST!E223<>\"\",\"人口銘木AL［\"&LIST!E223 &\"] \"&LIST!F223,\"\")","v":""},{"$f":"IF(LIST!G223=\"\",\"\",LIST!K223)","v":""},{"$f":"IF(LIST!O223=\"\",\"\",LIST!O223)","v":""},{"$f":"IF(LIST!H223=\"\",\"\",IF(LIST!I223=0,\"H\"&LIST!J223,\"W\"&LIST!I223&IF(LIST!J223=0,\"\",\" H\"&LIST!J223)))","v":""}]
[{"$f":"IF(LIST!G224=\"\",\"\",LIST!G224)","v":""},{"$f":"IF(LIST!E224<>\"\",\"人口銘木AL［\"&LIST!E224 &\"] \"&LIST!F224,\"\")","v":""},{"$f":"IF(LIST!G224=\"\",\"\",LIST!K224)","v":""},{"$f":"IF(LIST!O224=\"\",\"\",LIST!O224)","v":""},{"$f":"IF(LIST!H224=\"\",\"\",IF(LIST!I224=0,\"H\"&LIST!J224,\"W\"&LIST!I224&IF(LIST!J224=0,\"\",\" H\"&LIST!J224)))","v":""}]
[{"$f":"IF(LIST!G225=\"\",\"\",LIST!G225)","v":""},{"$f":"IF(LIST!E225<>\"\",\"人口銘木AL［\"&LIST!E225 &\"] \"&LIST!F225,\"\")","v":""},{"$f":"IF(LIST!G225=\"\",\"\",LIST!K225)","v":""},{"$f":"IF(LIST!O225=\"\",\"\",LIST!O225)","v":""},{"$f":"IF(LIST!H225=\"\",\"\",IF(LIST!I225=0,\"H\"&LIST!J225,\"W\"&LIST!I225&IF(LIST!J225=0,\"\",\" H\"&LIST!J225)))","v":""}]
[{"$f":"IF(LIST!G226=\"\",\"\",LIST!G226)","v":""},{"$f":"IF(LIST!E226<>\"\",\"人口銘木AL［\"&LIST!E226 &\"] \"&LIST!F226,\"\")","v":""},{"$f":"IF(LIST!G226=\"\",\"\",LIST!K226)","v":""},{"$f":"IF(LIST!O226=\"\",\"\",LIST!O226)","v":""},{"$f":"IF(LIST!H226=\"\",\"\",IF(LIST!I226=0,\"H\"&LIST!J226,\"W\"&LIST!I226&IF(LIST!J226=0,\"\",\" H\"&LIST!J226)))","v":""}]
[{"$f":"IF(LIST!G227=\"\",\"\",LIST!G227)","v":""},{"$f":"IF(LIST!E227<>\"\",\"人口銘木AL［\"&LIST!E227 &\"] \"&LIST!F227,\"\")","v":""},{"$f":"IF(LIST!G227=\"\",\"\",LIST!K227)","v":""},{"$f":"IF(LIST!O227=\"\",\"\",LIST!O227)","v":""},{"$f":"IF(LIST!H227=\"\",\"\",IF(LIST!I227=0,\"H\"&LIST!J227,\"W\"&LIST!I227&IF(LIST!J227=0,\"\",\" H\"&LIST!J227)))","v":""}]
[{"$f":"IF(LIST!G228=\"\",\"\",LIST!G228)","v":""},{"$f":"IF(LIST!E228<>\"\",\"人口銘木AL［\"&LIST!E228 &\"] \"&LIST!F228,\"\")","v":""},{"$f":"IF(LIST!G228=\"\",\"\",LIST!K228)","v":""},{"$f":"IF(LIST!O228=\"\",\"\",LIST!O228)","v":""},{"$f":"IF(LIST!H228=\"\",\"\",IF(LIST!I228=0,\"H\"&LIST!J228,\"W\"&LIST!I228&IF(LIST!J228=0,\"\",\" H\"&LIST!J228)))","v":""}]
[{"$f":"IF(LIST!G229=\"\",\"\",LIST!G229)","v":""},{"$f":"IF(LIST!E229<>\"\",\"人口銘木AL［\"&LIST!E229 &\"] \"&LIST!F229,\"\")","v":""},{"$f":"IF(LIST!G229=\"\",\"\",LIST!K229)","v":""},{"$f":"IF(LIST!O229=\"\",\"\",LIST!O229)","v":""},{"$f":"IF(LIST!H229=\"\",\"\",IF(LIST!I229=0,\"H\"&LIST!J229,\"W\"&LIST!I229&IF(LIST!J229=0,\"\",\" H\"&LIST!J229)))","v":""}]
[{"$f":"IF(LIST!G230=\"\",\"\",LIST!G230)","v":""},{"$f":"IF(LIST!E230<>\"\",\"人口銘木AL［\"&LIST!E230 &\"] \"&LIST!F230,\"\")","v":""},{"$f":"IF(LIST!G230=\"\",\"\",LIST!K230)","v":""},{"$f":"IF(LIST!O230=\"\",\"\",LIST!O230)","v":""},{"$f":"IF(LIST!H230=\"\",\"\",IF(LIST!I230=0,\"H\"&LIST!J230,\"W\"&LIST!I230&IF(LIST!J230=0,\"\",\" H\"&LIST!J230)))","v":""}]
[{"$f":"IF(LIST!G231=\"\",\"\",LIST!G231)","v":""},{"$f":"IF(LIST!E231<>\"\",\"人口銘木AL［\"&LIST!E231 &\"] \"&LIST!F231,\"\")","v":""},{"$f":"IF(LIST!G231=\"\",\"\",LIST!K231)","v":""},{"$f":"IF(LIST!O231=\"\",\"\",LIST!O231)","v":""},{"$f":"IF(LIST!H231=\"\",\"\",IF(LIST!I231=0,\"H\"&LIST!J231,\"W\"&LIST!I231&IF(LIST!J231=0,\"\",\" H\"&LIST!J231)))","v":""}]
[{"$f":"IF(LIST!G232=\"\",\"\",LIST!G232)","v":""},{"$f":"IF(LIST!E232<>\"\",\"人口銘木AL［\"&LIST!E232 &\"] \"&LIST!F232,\"\")","v":""},{"$f":"IF(LIST!G232=\"\",\"\",LIST!K232)","v":""},{"$f":"IF(LIST!O232=\"\",\"\",LIST!O232)","v":""},{"$f":"IF(LIST!H232=\"\",\"\",IF(LIST!I232=0,\"H\"&LIST!J232,\"W\"&LIST!I232&IF(LIST!J232=0,\"\",\" H\"&LIST!J232)))","v":""}]
[{"$f":"IF(LIST!G233=\"\",\"\",LIST!G233)","v":""},{"$f":"IF(LIST!E233<>\"\",\"人口銘木AL［\"&LIST!E233 &\"] \"&LIST!F233,\"\")","v":""},{"$f":"IF(LIST!G233=\"\",\"\",LIST!K233)","v":""},{"$f":"IF(LIST!O233=\"\",\"\",LIST!O233)","v":""},{"$f":"IF(LIST!H233=\"\",\"\",IF(LIST!I233=0,\"H\"&LIST!J233,\"W\"&LIST!I233&IF(LIST!J233=0,\"\",\" H\"&LIST!J233)))","v":""}]
[{"$f":"IF(LIST!G234=\"\",\"\",LIST!G234)","v":""},{"$f":"IF(LIST!E234<>\"\",\"人口銘木AL［\"&LIST!E234 &\"] \"&LIST!F234,\"\")","v":""},{"$f":"IF(LIST!G234=\"\",\"\",LIST!K234)","v":""},{"$f":"IF(LIST!O234=\"\",\"\",LIST!O234)","v":""},{"$f":"IF(LIST!H234=\"\",\"\",IF(LIST!I234=0,\"H\"&LIST!J234,\"W\"&LIST!I234&IF(LIST!J234=0,\"\",\" H\"&LIST!J234)))","v":""}]
[{"$f":"IF(LIST!G235=\"\",\"\",LIST!G235)","v":""},{"$f":"IF(LIST!E235<>\"\",\"人口銘木AL［\"&LIST!E235 &\"] \"&LIST!F235,\"\")","v":""},{"$f":"IF(LIST!G235=\"\",\"\",LIST!K235)","v":""},{"$f":"IF(LIST!O235=\"\",\"\",LIST!O235)","v":""},{"$f":"IF(LIST!H235=\"\",\"\",IF(LIST!I235=0,\"H\"&LIST!J235,\"W\"&LIST!I235&IF(LIST!J235=0,\"\",\" H\"&LIST!J235)))","v":""}]
[{"$f":"IF(LIST!G236=\"\",\"\",LIST!G236)","v":""},{"$f":"IF(LIST!E236<>\"\",\"人口銘木AL［\"&LIST!E236 &\"] \"&LIST!F236,\"\")","v":""},{"$f":"IF(LIST!G236=\"\",\"\",LIST!K236)","v":""},{"$f":"IF(LIST!O236=\"\",\"\",LIST!O236)","v":""},{"$f":"IF(LIST!H236=\"\",\"\",IF(LIST!I236=0,\"H\"&LIST!J236,\"W\"&LIST!I236&IF(LIST!J236=0,\"\",\" H\"&LIST!J236)))","v":""}]
[{"$f":"IF(LIST!G237=\"\",\"\",LIST!G237)","v":""},{"$f":"IF(LIST!E237<>\"\",\"人口銘木AL［\"&LIST!E237 &\"] \"&LIST!F237,\"\")","v":""},{"$f":"IF(LIST!G237=\"\",\"\",LIST!K237)","v":""},{"$f":"IF(LIST!O237=\"\",\"\",LIST!O237)","v":""},{"$f":"IF(LIST!H237=\"\",\"\",IF(LIST!I237=0,\"H\"&LIST!J237,\"W\"&LIST!I237&IF(LIST!J237=0,\"\",\" H\"&LIST!J237)))","v":""}]
[{"$f":"IF(LIST!G238=\"\",\"\",LIST!G238)","v":""},{"$f":"IF(LIST!E238<>\"\",\"人口銘木AL［\"&LIST!E238 &\"] \"&LIST!F238,\"\")","v":""},{"$f":"IF(LIST!G238=\"\",\"\",LIST!K238)","v":""},{"$f":"IF(LIST!O238=\"\",\"\",LIST!O238)","v":""},{"$f":"IF(LIST!H238=\"\",\"\",IF(LIST!I238=0,\"H\"&LIST!J238,\"W\"&LIST!I238&IF(LIST!J238=0,\"\",\" H\"&LIST!J238)))","v":""}]
[{"$f":"IF(LIST!G239=\"\",\"\",LIST!G239)","v":""},{"$f":"IF(LIST!E239<>\"\",\"人口銘木AL［\"&LIST!E239 &\"] \"&LIST!F239,\"\")","v":""},{"$f":"IF(LIST!G239=\"\",\"\",LIST!K239)","v":""},{"$f":"IF(LIST!O239=\"\",\"\",LIST!O239)","v":""},{"$f":"IF(LIST!H239=\"\",\"\",IF(LIST!I239=0,\"H\"&LIST!J239,\"W\"&LIST!I239&IF(LIST!J239=0,\"\",\" H\"&LIST!J239)))","v":""}]
[{"$f":"IF(LIST!G240=\"\",\"\",LIST!G240)","v":""},{"$f":"IF(LIST!E240<>\"\",\"人口銘木AL［\"&LIST!E240 &\"] \"&LIST!F240,\"\")","v":""},{"$f":"IF(LIST!G240=\"\",\"\",LIST!K240)","v":""},{"$f":"IF(LIST!O240=\"\",\"\",LIST!O240)","v":""},{"$f":"IF(LIST!H240=\"\",\"\",IF(LIST!I240=0,\"H\"&LIST!J240,\"W\"&LIST!I240&IF(LIST!J240=0,\"\",\" H\"&LIST!J240)))","v":""}]
[{"$f":"IF(LIST!G241=\"\",\"\",LIST!G241)","v":""},{"$f":"IF(LIST!E241<>\"\",\"人口銘木AL［\"&LIST!E241 &\"] \"&LIST!F241,\"\")","v":""},{"$f":"IF(LIST!G241=\"\",\"\",LIST!K241)","v":""},{"$f":"IF(LIST!O241=\"\",\"\",LIST!O241)","v":""},{"$f":"IF(LIST!H241=\"\",\"\",IF(LIST!I241=0,\"H\"&LIST!J241,\"W\"&LIST!I241&IF(LIST!J241=0,\"\",\" H\"&LIST!J241)))","v":""}]
[{"$f":"IF(LIST!G242=\"\",\"\",LIST!G242)","v":""},{"$f":"IF(LIST!E242<>\"\",\"人口銘木AL［\"&LIST!E242 &\"] \"&LIST!F242,\"\")","v":""},{"$f":"IF(LIST!G242=\"\",\"\",LIST!K242)","v":""},{"$f":"IF(LIST!O242=\"\",\"\",LIST!O242)","v":""},{"$f":"IF(LIST!H242=\"\",\"\",IF(LIST!I242=0,\"H\"&LIST!J242,\"W\"&LIST!I242&IF(LIST!J242=0,\"\",\" H\"&LIST!J242)))","v":""}]
[{"$f":"IF(LIST!G243=\"\",\"\",LIST!G243)","v":""},{"$f":"IF(LIST!E243<>\"\",\"人口銘木AL［\"&LIST!E243 &\"] \"&LIST!F243,\"\")","v":""},{"$f":"IF(LIST!G243=\"\",\"\",LIST!K243)","v":""},{"$f":"IF(LIST!O243=\"\",\"\",LIST!O243)","v":""},{"$f":"IF(LIST!H243=\"\",\"\",IF(LIST!I243=0,\"H\"&LIST!J243,\"W\"&LIST!I243&IF(LIST!J243=0,\"\",\" H\"&LIST!J243)))","v":""}]
[{"$f":"IF(LIST!G244=\"\",\"\",LIST!G244)","v":""},{"$f":"IF(LIST!E244<>\"\",\"人口銘木AL［\"&LIST!E244 &\"] \"&LIST!F244,\"\")","v":""},{"$f":"IF(LIST!G244=\"\",\"\",LIST!K244)","v":""},{"$f":"IF(LIST!O244=\"\",\"\",LIST!O244)","v":""},{"$f":"IF(LIST!H244=\"\",\"\",IF(LIST!I244=0,\"H\"&LIST!J244,\"W\"&LIST!I244&IF(LIST!J244=0,\"\",\" H\"&LIST!J244)))","v":""}]
[{"$f":"IF(LIST!G245=\"\",\"\",LIST!G245)","v":""},{"$f":"IF(LIST!E245<>\"\",\"人口銘木AL［\"&LIST!E245 &\"] \"&LIST!F245,\"\")","v":""},{"$f":"IF(LIST!G245=\"\",\"\",LIST!K245)","v":""},{"$f":"IF(LIST!O245=\"\",\"\",LIST!O245)","v":""},{"$f":"IF(LIST!H245=\"\",\"\",IF(LIST!I245=0,\"H\"&LIST!J245,\"W\"&LIST!I245&IF(LIST!J245=0,\"\",\" H\"&LIST!J245)))","v":""}]
[{"$f":"IF(LIST!G246=\"\",\"\",LIST!G246)","v":""},{"$f":"IF(LIST!E246<>\"\",\"人口銘木AL［\"&LIST!E246 &\"] \"&LIST!F246,\"\")","v":""},{"$f":"IF(LIST!G246=\"\",\"\",LIST!K246)","v":""},{"$f":"IF(LIST!O246=\"\",\"\",LIST!O246)","v":""},{"$f":"IF(LIST!H246=\"\",\"\",IF(LIST!I246=0,\"H\"&LIST!J246,\"W\"&LIST!I246&IF(LIST!J246=0,\"\",\" H\"&LIST!J246)))","v":""}]
[{"$f":"IF(LIST!G247=\"\",\"\",LIST!G247)","v":""},{"$f":"IF(LIST!E247<>\"\",\"人口銘木AL［\"&LIST!E247 &\"] \"&LIST!F247,\"\")","v":""},{"$f":"IF(LIST!G247=\"\",\"\",LIST!K247)","v":""},{"$f":"IF(LIST!O247=\"\",\"\",LIST!O247)","v":""},{"$f":"IF(LIST!H247=\"\",\"\",IF(LIST!I247=0,\"H\"&LIST!J247,\"W\"&LIST!I247&IF(LIST!J247=0,\"\",\" H\"&LIST!J247)))","v":""}]
[{"$f":"IF(LIST!G248=\"\",\"\",LIST!G248)","v":""},{"$f":"IF(LIST!E248<>\"\",\"人口銘木AL［\"&LIST!E248 &\"] \"&LIST!F248,\"\")","v":""},{"$f":"IF(LIST!G248=\"\",\"\",LIST!K248)","v":""},{"$f":"IF(LIST!O248=\"\",\"\",LIST!O248)","v":""},{"$f":"IF(LIST!H248=\"\",\"\",IF(LIST!I248=0,\"H\"&LIST!J248,\"W\"&LIST!I248&IF(LIST!J248=0,\"\",\" H\"&LIST!J248)))","v":""}]
[{"$f":"IF(LIST!G249=\"\",\"\",LIST!G249)","v":""},{"$f":"IF(LIST!E249<>\"\",\"人口銘木AL［\"&LIST!E249 &\"] \"&LIST!F249,\"\")","v":""},{"$f":"IF(LIST!G249=\"\",\"\",LIST!K249)","v":""},{"$f":"IF(LIST!O249=\"\",\"\",LIST!O249)","v":""},{"$f":"IF(LIST!H249=\"\",\"\",IF(LIST!I249=0,\"H\"&LIST!J249,\"W\"&LIST!I249&IF(LIST!J249=0,\"\",\" H\"&LIST!J249)))","v":""}]
[{"$f":"IF(LIST!G250=\"\",\"\",LIST!G250)","v":""},{"$f":"IF(LIST!E250<>\"\",\"人口銘木AL［\"&LIST!E250 &\"] \"&LIST!F250,\"\")","v":""},{"$f":"IF(LIST!G250=\"\",\"\",LIST!K250)","v":""},{"$f":"IF(LIST!O250=\"\",\"\",LIST!O250)","v":""},{"$f":"IF(LIST!H250=\"\",\"\",IF(LIST!I250=0,\"H\"&LIST!J250,\"W\"&LIST!I250&IF(LIST!J250=0,\"\",\" H\"&LIST!J250)))","v":""}]
[{"$f":"IF(LIST!G251=\"\",\"\",LIST!G251)","v":""},{"$f":"IF(LIST!E251<>\"\",\"人口銘木AL［\"&LIST!E251 &\"] \"&LIST!F251,\"\")","v":""},{"$f":"IF(LIST!G251=\"\",\"\",LIST!K251)","v":""},{"$f":"IF(LIST!O251=\"\",\"\",LIST!O251)","v":""},{"$f":"IF(LIST!H251=\"\",\"\",IF(LIST!I251=0,\"H\"&LIST!J251,\"W\"&LIST!I251&IF(LIST!J251=0,\"\",\" H\"&LIST!J251)))","v":""}]
[{"$f":"IF(LIST!G252=\"\",\"\",LIST!G252)","v":""},{"$f":"IF(LIST!E252<>\"\",\"人口銘木AL［\"&LIST!E252 &\"] \"&LIST!F252,\"\")","v":""},{"$f":"IF(LIST!G252=\"\",\"\",LIST!K252)","v":""},{"$f":"IF(LIST!O252=\"\",\"\",LIST!O252)","v":""},{"$f":"IF(LIST!H252=\"\",\"\",IF(LIST!I252=0,\"H\"&LIST!J252,\"W\"&LIST!I252&IF(LIST!J252=0,\"\",\" H\"&LIST!J252)))","v":""}]
[{"$f":"IF(LIST!G253=\"\",\"\",LIST!G253)","v":""},{"$f":"IF(LIST!E253<>\"\",\"人口銘木AL［\"&LIST!E253 &\"] \"&LIST!F253,\"\")","v":""},{"$f":"IF(LIST!G253=\"\",\"\",LIST!K253)","v":""},{"$f":"IF(LIST!O253=\"\",\"\",LIST!O253)","v":""},{"$f":"IF(LIST!H253=\"\",\"\",IF(LIST!I253=0,\"H\"&LIST!J253,\"W\"&LIST!I253&IF(LIST!J253=0,\"\",\" H\"&LIST!J253)))","v":""}]
[{"$f":"IF(LIST!G254=\"\",\"\",LIST!G254)","v":""},{"$f":"IF(LIST!E254<>\"\",\"人口銘木AL［\"&LIST!E254 &\"] \"&LIST!F254,\"\")","v":""},{"$f":"IF(LIST!G254=\"\",\"\",LIST!K254)","v":""},{"$f":"IF(LIST!O254=\"\",\"\",LIST!O254)","v":""},{"$f":"IF(LIST!H254=\"\",\"\",IF(LIST!I254=0,\"H\"&LIST!J254,\"W\"&LIST!I254&IF(LIST!J254=0,\"\",\" H\"&LIST!J254)))","v":""}]
[{"$f":"IF(LIST!G255=\"\",\"\",LIST!G255)","v":""},{"$f":"IF(LIST!E255<>\"\",\"人口銘木AL［\"&LIST!E255 &\"] \"&LIST!F255,\"\")","v":""},{"$f":"IF(LIST!G255=\"\",\"\",LIST!K255)","v":""},{"$f":"IF(LIST!O255=\"\",\"\",LIST!O255)","v":""},{"$f":"IF(LIST!H255=\"\",\"\",IF(LIST!I255=0,\"H\"&LIST!J255,\"W\"&LIST!I255&IF(LIST!J255=0,\"\",\" H\"&LIST!J255)))","v":""}]
[{"$f":"IF(LIST!G256=\"\",\"\",LIST!G256)","v":""},{"$f":"IF(LIST!E256<>\"\",\"人口銘木AL［\"&LIST!E256 &\"] \"&LIST!F256,\"\")","v":""},{"$f":"IF(LIST!G256=\"\",\"\",LIST!K256)","v":""},{"$f":"IF(LIST!O256=\"\",\"\",LIST!O256)","v":""},{"$f":"IF(LIST!H256=\"\",\"\",IF(LIST!I256=0,\"H\"&LIST!J256,\"W\"&LIST!I256&IF(LIST!J256=0,\"\",\" H\"&LIST!J256)))","v":""}]
[{"$f":"IF(LIST!G257=\"\",\"\",LIST!G257)","v":""},{"$f":"IF(LIST!E257<>\"\",\"人口銘木AL［\"&LIST!E257 &\"] \"&LIST!F257,\"\")","v":""},{"$f":"IF(LIST!G257=\"\",\"\",LIST!K257)","v":""},{"$f":"IF(LIST!O257=\"\",\"\",LIST!O257)","v":""},{"$f":"IF(LIST!H257=\"\",\"\",IF(LIST!I257=0,\"H\"&LIST!J257,\"W\"&LIST!I257&IF(LIST!J257=0,\"\",\" H\"&LIST!J257)))","v":""}]
[{"$f":"IF(LIST!G258=\"\",\"\",LIST!G258)","v":""},{"$f":"IF(LIST!E258<>\"\",\"人口銘木AL［\"&LIST!E258 &\"] \"&LIST!F258,\"\")","v":""},{"$f":"IF(LIST!G258=\"\",\"\",LIST!K258)","v":""},{"$f":"IF(LIST!O258=\"\",\"\",LIST!O258)","v":""},{"$f":"IF(LIST!H258=\"\",\"\",IF(LIST!I258=0,\"H\"&LIST!J258,\"W\"&LIST!I258&IF(LIST!J258=0,\"\",\" H\"&LIST!J258)))","v":""}]
[{"$f":"IF(LIST!G259=\"\",\"\",LIST!G259)","v":""},{"$f":"IF(LIST!E259<>\"\",\"人口銘木AL［\"&LIST!E259 &\"] \"&LIST!F259,\"\")","v":""},{"$f":"IF(LIST!G259=\"\",\"\",LIST!K259)","v":""},{"$f":"IF(LIST!O259=\"\",\"\",LIST!O259)","v":""},{"$f":"IF(LIST!H259=\"\",\"\",IF(LIST!I259=0,\"H\"&LIST!J259,\"W\"&LIST!I259&IF(LIST!J259=0,\"\",\" H\"&LIST!J259)))","v":""}]
[{"$f":"IF(LIST!G260=\"\",\"\",LIST!G260)","v":""},{"$f":"IF(LIST!E260<>\"\",\"人口銘木AL［\"&LIST!E260 &\"] \"&LIST!F260,\"\")","v":""},{"$f":"IF(LIST!G260=\"\",\"\",LIST!K260)","v":""},{"$f":"IF(LIST!O260=\"\",\"\",LIST!O260)","v":""},{"$f":"IF(LIST!H260=\"\",\"\",IF(LIST!I260=0,\"H\"&LIST!J260,\"W\"&LIST!I260&IF(LIST!J260=0,\"\",\" H\"&LIST!J260)))","v":""}]
[{"$f":"IF(LIST!G261=\"\",\"\",LIST!G261)","v":""},{"$f":"IF(LIST!E261<>\"\",\"人口銘木AL［\"&LIST!E261 &\"] \"&LIST!F261,\"\")","v":""},{"$f":"IF(LIST!G261=\"\",\"\",LIST!K261)","v":""},{"$f":"IF(LIST!O261=\"\",\"\",LIST!O261)","v":""},{"$f":"IF(LIST!H261=\"\",\"\",IF(LIST!I261=0,\"H\"&LIST!J261,\"W\"&LIST!I261&IF(LIST!J261=0,\"\",\" H\"&LIST!J261)))","v":""}]
[{"$f":"IF(LIST!G262=\"\",\"\",LIST!G262)","v":""},{"$f":"IF(LIST!E262<>\"\",\"人口銘木AL［\"&LIST!E262 &\"] \"&LIST!F262,\"\")","v":""},{"$f":"IF(LIST!G262=\"\",\"\",LIST!K262)","v":""},{"$f":"IF(LIST!O262=\"\",\"\",LIST!O262)","v":""},{"$f":"IF(LIST!H262=\"\",\"\",IF(LIST!I262=0,\"H\"&LIST!J262,\"W\"&LIST!I262&IF(LIST!J262=0,\"\",\" H\"&LIST!J262)))","v":""}]
[{"$f":"IF(LIST!G263=\"\",\"\",LIST!G263)","v":""},{"$f":"IF(LIST!E263<>\"\",\"人口銘木AL［\"&LIST!E263 &\"] \"&LIST!F263,\"\")","v":""},{"$f":"IF(LIST!G263=\"\",\"\",LIST!K263)","v":""},{"$f":"IF(LIST!O263=\"\",\"\",LIST!O263)","v":""},{"$f":"IF(LIST!H263=\"\",\"\",IF(LIST!I263=0,\"H\"&LIST!J263,\"W\"&LIST!I263&IF(LIST!J263=0,\"\",\" H\"&LIST!J263)))","v":""}]
[{"$f":"IF(LIST!G264=\"\",\"\",LIST!G264)","v":""},{"$f":"IF(LIST!E264<>\"\",\"人口銘木AL［\"&LIST!E264 &\"] \"&LIST!F264,\"\")","v":""},{"$f":"IF(LIST!G264=\"\",\"\",LIST!K264)","v":""},{"$f":"IF(LIST!O264=\"\",\"\",LIST!O264)","v":""},{"$f":"IF(LIST!H264=\"\",\"\",IF(LIST!I264=0,\"H\"&LIST!J264,\"W\"&LIST!I264&IF(LIST!J264=0,\"\",\" H\"&LIST!J264)))","v":""}]
[{"$f":"IF(LIST!G265=\"\",\"\",LIST!G265)","v":""},{"$f":"IF(LIST!E265<>\"\",\"人口銘木AL［\"&LIST!E265 &\"] \"&LIST!F265,\"\")","v":""},{"$f":"IF(LIST!G265=\"\",\"\",LIST!K265)","v":""},{"$f":"IF(LIST!O265=\"\",\"\",LIST!O265)","v":""},{"$f":"IF(LIST!H265=\"\",\"\",IF(LIST!I265=0,\"H\"&LIST!J265,\"W\"&LIST!I265&IF(LIST!J265=0,\"\",\" H\"&LIST!J265)))","v":""}]
[{"$f":"IF(LIST!G266=\"\",\"\",LIST!G266)","v":""},{"$f":"IF(LIST!E266<>\"\",\"人口銘木AL［\"&LIST!E266 &\"] \"&LIST!F266,\"\")","v":""},{"$f":"IF(LIST!G266=\"\",\"\",LIST!K266)","v":""},{"$f":"IF(LIST!O266=\"\",\"\",LIST!O266)","v":""},{"$f":"IF(LIST!H266=\"\",\"\",IF(LIST!I266=0,\"H\"&LIST!J266,\"W\"&LIST!I266&IF(LIST!J266=0,\"\",\" H\"&LIST!J266)))","v":""}]
[{"$f":"IF(LIST!G267=\"\",\"\",LIST!G267)","v":""},{"$f":"IF(LIST!E267<>\"\",\"人口銘木AL［\"&LIST!E267 &\"] \"&LIST!F267,\"\")","v":""},{"$f":"IF(LIST!G267=\"\",\"\",LIST!K267)","v":""},{"$f":"IF(LIST!O267=\"\",\"\",LIST!O267)","v":""},{"$f":"IF(LIST!H267=\"\",\"\",IF(LIST!I267=0,\"H\"&LIST!J267,\"W\"&LIST!I267&IF(LIST!J267=0,\"\",\" H\"&LIST!J267)))","v":""}]
[{"$f":"IF(LIST!G268=\"\",\"\",LIST!G268)","v":""},{"$f":"IF(LIST!E268<>\"\",\"人口銘木AL［\"&LIST!E268 &\"] \"&LIST!F268,\"\")","v":""},{"$f":"IF(LIST!G268=\"\",\"\",LIST!K268)","v":""},{"$f":"IF(LIST!O268=\"\",\"\",LIST!O268)","v":""},{"$f":"IF(LIST!H268=\"\",\"\",IF(LIST!I268=0,\"H\"&LIST!J268,\"W\"&LIST!I268&IF(LIST!J268=0,\"\",\" H\"&LIST!J268)))","v":""}]
[{"$f":"IF(LIST!G269=\"\",\"\",LIST!G269)","v":""},{"$f":"IF(LIST!E269<>\"\",\"人口銘木AL［\"&LIST!E269 &\"] \"&LIST!F269,\"\")","v":""},{"$f":"IF(LIST!G269=\"\",\"\",LIST!K269)","v":""},{"$f":"IF(LIST!O269=\"\",\"\",LIST!O269)","v":""},{"$f":"IF(LIST!H269=\"\",\"\",IF(LIST!I269=0,\"H\"&LIST!J269,\"W\"&LIST!I269&IF(LIST!J269=0,\"\",\" H\"&LIST!J269)))","v":""}]
[{"$f":"IF(LIST!G270=\"\",\"\",LIST!G270)","v":""},{"$f":"IF(LIST!E270<>\"\",\"人口銘木AL［\"&LIST!E270 &\"] \"&LIST!F270,\"\")","v":""},{"$f":"IF(LIST!G270=\"\",\"\",LIST!K270)","v":""},{"$f":"IF(LIST!O270=\"\",\"\",LIST!O270)","v":""},{"$f":"IF(LIST!H270=\"\",\"\",IF(LIST!I270=0,\"H\"&LIST!J270,\"W\"&LIST!I270&IF(LIST!J270=0,\"\",\" H\"&LIST!J270)))","v":""}]
[{"$f":"IF(LIST!G271=\"\",\"\",LIST!G271)","v":""},{"$f":"IF(LIST!E271<>\"\",\"人口銘木AL［\"&LIST!E271 &\"] \"&LIST!F271,\"\")","v":""},{"$f":"IF(LIST!G271=\"\",\"\",LIST!K271)","v":""},{"$f":"IF(LIST!O271=\"\",\"\",LIST!O271)","v":""},{"$f":"IF(LIST!H271=\"\",\"\",IF(LIST!I271=0,\"H\"&LIST!J271,\"W\"&LIST!I271&IF(LIST!J271=0,\"\",\" H\"&LIST!J271)))","v":""}]
[{"$f":"IF(LIST!G272=\"\",\"\",LIST!G272)","v":""},{"$f":"IF(LIST!E272<>\"\",\"人口銘木AL［\"&LIST!E272 &\"] \"&LIST!F272,\"\")","v":""},{"$f":"IF(LIST!G272=\"\",\"\",LIST!K272)","v":""},{"$f":"IF(LIST!O272=\"\",\"\",LIST!O272)","v":""},{"$f":"IF(LIST!H272=\"\",\"\",IF(LIST!I272=0,\"H\"&LIST!J272,\"W\"&LIST!I272&IF(LIST!J272=0,\"\",\" H\"&LIST!J272)))","v":""}]
[{"$f":"IF(LIST!G273=\"\",\"\",LIST!G273)","v":""},{"$f":"IF(LIST!E273<>\"\",\"人口銘木AL［\"&LIST!E273 &\"] \"&LIST!F273,\"\")","v":""},{"$f":"IF(LIST!G273=\"\",\"\",LIST!K273)","v":""},{"$f":"IF(LIST!O273=\"\",\"\",LIST!O273)","v":""},{"$f":"IF(LIST!H273=\"\",\"\",IF(LIST!I273=0,\"H\"&LIST!J273,\"W\"&LIST!I273&IF(LIST!J273=0,\"\",\" H\"&LIST!J273)))","v":""}]
[{"$f":"IF(LIST!G274=\"\",\"\",LIST!G274)","v":""},{"$f":"IF(LIST!E274<>\"\",\"人口銘木AL［\"&LIST!E274 &\"] \"&LIST!F274,\"\")","v":""},{"$f":"IF(LIST!G274=\"\",\"\",LIST!K274)","v":""},{"$f":"IF(LIST!O274=\"\",\"\",LIST!O274)","v":""},{"$f":"IF(LIST!H274=\"\",\"\",IF(LIST!I274=0,\"H\"&LIST!J274,\"W\"&LIST!I274&IF(LIST!J274=0,\"\",\" H\"&LIST!J274)))","v":""}]
[{"$f":"IF(LIST!G275=\"\",\"\",LIST!G275)","v":""},{"$f":"IF(LIST!E275<>\"\",\"人口銘木AL［\"&LIST!E275 &\"] \"&LIST!F275,\"\")","v":""},{"$f":"IF(LIST!G275=\"\",\"\",LIST!K275)","v":""},{"$f":"IF(LIST!O275=\"\",\"\",LIST!O275)","v":""},{"$f":"IF(LIST!H275=\"\",\"\",IF(LIST!I275=0,\"H\"&LIST!J275,\"W\"&LIST!I275&IF(LIST!J275=0,\"\",\" H\"&LIST!J275)))","v":""}]
[{"$f":"IF(LIST!G276=\"\",\"\",LIST!G276)","v":""},{"$f":"IF(LIST!E276<>\"\",\"人口銘木AL［\"&LIST!E276 &\"] \"&LIST!F276,\"\")","v":""},{"$f":"IF(LIST!G276=\"\",\"\",LIST!K276)","v":""},{"$f":"IF(LIST!O276=\"\",\"\",LIST!O276)","v":""},{"$f":"IF(LIST!H276=\"\",\"\",IF(LIST!I276=0,\"H\"&LIST!J276,\"W\"&LIST!I276&IF(LIST!J276=0,\"\",\" H\"&LIST!J276)))","v":""}]
[{"$f":"IF(LIST!G277=\"\",\"\",LIST!G277)","v":""},{"$f":"IF(LIST!E277<>\"\",\"人口銘木AL［\"&LIST!E277 &\"] \"&LIST!F277,\"\")","v":""},{"$f":"IF(LIST!G277=\"\",\"\",LIST!K277)","v":""},{"$f":"IF(LIST!O277=\"\",\"\",LIST!O277)","v":""},{"$f":"IF(LIST!H277=\"\",\"\",IF(LIST!I277=0,\"H\"&LIST!J277,\"W\"&LIST!I277&IF(LIST!J277=0,\"\",\" H\"&LIST!J277)))","v":""}]
[{"$f":"IF(LIST!G278=\"\",\"\",LIST!G278)","v":""},{"$f":"IF(LIST!E278<>\"\",\"人口銘木AL［\"&LIST!E278 &\"] \"&LIST!F278,\"\")","v":""},{"$f":"IF(LIST!G278=\"\",\"\",LIST!K278)","v":""},{"$f":"IF(LIST!O278=\"\",\"\",LIST!O278)","v":""},{"$f":"IF(LIST!H278=\"\",\"\",IF(LIST!I278=0,\"H\"&LIST!J278,\"W\"&LIST!I278&IF(LIST!J278=0,\"\",\" H\"&LIST!J278)))","v":""}]
[{"$f":"IF(LIST!G279=\"\",\"\",LIST!G279)","v":""},{"$f":"IF(LIST!E279<>\"\",\"人口銘木AL［\"&LIST!E279 &\"] \"&LIST!F279,\"\")","v":""},{"$f":"IF(LIST!G279=\"\",\"\",LIST!K279)","v":""},{"$f":"IF(LIST!O279=\"\",\"\",LIST!O279)","v":""},{"$f":"IF(LIST!H279=\"\",\"\",IF(LIST!I279=0,\"H\"&LIST!J279,\"W\"&LIST!I279&IF(LIST!J279=0,\"\",\" H\"&LIST!J279)))","v":""}]
[{"$f":"IF(LIST!G280=\"\",\"\",LIST!G280)","v":""},{"$f":"IF(LIST!E280<>\"\",\"人口銘木AL［\"&LIST!E280 &\"] \"&LIST!F280,\"\")","v":""},{"$f":"IF(LIST!G280=\"\",\"\",LIST!K280)","v":""},{"$f":"IF(LIST!O280=\"\",\"\",LIST!O280)","v":""},{"$f":"IF(LIST!H280=\"\",\"\",IF(LIST!I280=0,\"H\"&LIST!J280,\"W\"&LIST!I280&IF(LIST!J280=0,\"\",\" H\"&LIST!J280)))","v":""}]
[{"$f":"IF(LIST!G281=\"\",\"\",LIST!G281)","v":""},{"$f":"IF(LIST!E281<>\"\",\"人口銘木AL［\"&LIST!E281 &\"] \"&LIST!F281,\"\")","v":""},{"$f":"IF(LIST!G281=\"\",\"\",LIST!K281)","v":""},{"$f":"IF(LIST!O281=\"\",\"\",LIST!O281)","v":""},{"$f":"IF(LIST!H281=\"\",\"\",IF(LIST!I281=0,\"H\"&LIST!J281,\"W\"&LIST!I281&IF(LIST!J281=0,\"\",\" H\"&LIST!J281)))","v":""}]
[{"$f":"IF(LIST!G282=\"\",\"\",LIST!G282)","v":""},{"$f":"IF(LIST!E282<>\"\",\"人口銘木AL［\"&LIST!E282 &\"] \"&LIST!F282,\"\")","v":""},{"$f":"IF(LIST!G282=\"\",\"\",LIST!K282)","v":""},{"$f":"IF(LIST!O282=\"\",\"\",LIST!O282)","v":""},{"$f":"IF(LIST!H282=\"\",\"\",IF(LIST!I282=0,\"H\"&LIST!J282,\"W\"&LIST!I282&IF(LIST!J282=0,\"\",\" H\"&LIST!J282)))","v":""}]
[{"$f":"IF(LIST!G283=\"\",\"\",LIST!G283)","v":""},{"$f":"IF(LIST!E283<>\"\",\"人口銘木AL［\"&LIST!E283 &\"] \"&LIST!F283,\"\")","v":""},{"$f":"IF(LIST!G283=\"\",\"\",LIST!K283)","v":""},{"$f":"IF(LIST!O283=\"\",\"\",LIST!O283)","v":""},{"$f":"IF(LIST!H283=\"\",\"\",IF(LIST!I283=0,\"H\"&LIST!J283,\"W\"&LIST!I283&IF(LIST!J283=0,\"\",\" H\"&LIST!J283)))","v":""}]
[{"$f":"IF(LIST!G284=\"\",\"\",LIST!G284)","v":""},{"$f":"IF(LIST!E284<>\"\",\"人口銘木AL［\"&LIST!E284 &\"] \"&LIST!F284,\"\")","v":""},{"$f":"IF(LIST!G284=\"\",\"\",LIST!K284)","v":""},{"$f":"IF(LIST!O284=\"\",\"\",LIST!O284)","v":""},{"$f":"IF(LIST!H284=\"\",\"\",IF(LIST!I284=0,\"H\"&LIST!J284,\"W\"&LIST!I284&IF(LIST!J284=0,\"\",\" H\"&LIST!J284)))","v":""}]
[{"$f":"IF(LIST!G285=\"\",\"\",LIST!G285)","v":""},{"$f":"IF(LIST!E285<>\"\",\"人口銘木AL［\"&LIST!E285 &\"] \"&LIST!F285,\"\")","v":""},{"$f":"IF(LIST!G285=\"\",\"\",LIST!K285)","v":""},{"$f":"IF(LIST!O285=\"\",\"\",LIST!O285)","v":""},{"$f":"IF(LIST!H285=\"\",\"\",IF(LIST!I285=0,\"H\"&LIST!J285,\"W\"&LIST!I285&IF(LIST!J285=0,\"\",\" H\"&LIST!J285)))","v":""}]
[{"$f":"IF(LIST!G286=\"\",\"\",LIST!G286)","v":""},{"$f":"IF(LIST!E286<>\"\",\"人口銘木AL［\"&LIST!E286 &\"] \"&LIST!F286,\"\")","v":""},{"$f":"IF(LIST!G286=\"\",\"\",LIST!K286)","v":""},{"$f":"IF(LIST!O286=\"\",\"\",LIST!O286)","v":""},{"$f":"IF(LIST!H286=\"\",\"\",IF(LIST!I286=0,\"H\"&LIST!J286,\"W\"&LIST!I286&IF(LIST!J286=0,\"\",\" H\"&LIST!J286)))","v":""}]
[{"$f":"IF(LIST!G287=\"\",\"\",LIST!G287)","v":""},{"$f":"IF(LIST!E287<>\"\",\"人口銘木AL［\"&LIST!E287 &\"] \"&LIST!F287,\"\")","v":""},{"$f":"IF(LIST!G287=\"\",\"\",LIST!K287)","v":""},{"$f":"IF(LIST!O287=\"\",\"\",LIST!O287)","v":""},{"$f":"IF(LIST!H287=\"\",\"\",IF(LIST!I287=0,\"H\"&LIST!J287,\"W\"&LIST!I287&IF(LIST!J287=0,\"\",\" H\"&LIST!J287)))","v":""}]
[{"$f":"IF(LIST!G288=\"\",\"\",LIST!G288)","v":""},{"$f":"IF(LIST!E288<>\"\",\"人口銘木AL［\"&LIST!E288 &\"] \"&LIST!F288,\"\")","v":""},{"$f":"IF(LIST!G288=\"\",\"\",LIST!K288)","v":""},{"$f":"IF(LIST!O288=\"\",\"\",LIST!O288)","v":""},{"$f":"IF(LIST!H288=\"\",\"\",IF(LIST!I288=0,\"H\"&LIST!J288,\"W\"&LIST!I288&IF(LIST!J288=0,\"\",\" H\"&LIST!J288)))","v":""}]
[{"$f":"IF(LIST!G289=\"\",\"\",LIST!G289)","v":""},{"$f":"IF(LIST!E289<>\"\",\"人口銘木AL［\"&LIST!E289 &\"] \"&LIST!F289,\"\")","v":""},{"$f":"IF(LIST!G289=\"\",\"\",LIST!K289)","v":""},{"$f":"IF(LIST!O289=\"\",\"\",LIST!O289)","v":""},{"$f":"IF(LIST!H289=\"\",\"\",IF(LIST!I289=0,\"H\"&LIST!J289,\"W\"&LIST!I289&IF(LIST!J289=0,\"\",\" H\"&LIST!J289)))","v":""}]
[{"$f":"IF(LIST!G290=\"\",\"\",LIST!G290)","v":""},{"$f":"IF(LIST!E290<>\"\",\"人口銘木AL［\"&LIST!E290 &\"] \"&LIST!F290,\"\")","v":""},{"$f":"IF(LIST!G290=\"\",\"\",LIST!K290)","v":""},{"$f":"IF(LIST!O290=\"\",\"\",LIST!O290)","v":""},{"$f":"IF(LIST!H290=\"\",\"\",IF(LIST!I290=0,\"H\"&LIST!J290,\"W\"&LIST!I290&IF(LIST!J290=0,\"\",\" H\"&LIST!J290)))","v":""}]
[{"$f":"IF(LIST!G291=\"\",\"\",LIST!G291)","v":""},{"$f":"IF(LIST!E291<>\"\",\"人口銘木AL［\"&LIST!E291 &\"] \"&LIST!F291,\"\")","v":""},{"$f":"IF(LIST!G291=\"\",\"\",LIST!K291)","v":""},{"$f":"IF(LIST!O291=\"\",\"\",LIST!O291)","v":""},{"$f":"IF(LIST!H291=\"\",\"\",IF(LIST!I291=0,\"H\"&LIST!J291,\"W\"&LIST!I291&IF(LIST!J291=0,\"\",\" H\"&LIST!J291)))","v":""}]
[{"$f":"IF(LIST!G292=\"\",\"\",LIST!G292)","v":""},{"$f":"IF(LIST!E292<>\"\",\"人口銘木AL［\"&LIST!E292 &\"] \"&LIST!F292,\"\")","v":""},{"$f":"IF(LIST!G292=\"\",\"\",LIST!K292)","v":""},{"$f":"IF(LIST!O292=\"\",\"\",LIST!O292)","v":""},{"$f":"IF(LIST!H292=\"\",\"\",IF(LIST!I292=0,\"H\"&LIST!J292,\"W\"&LIST!I292&IF(LIST!J292=0,\"\",\" H\"&LIST!J292)))","v":""}]
[{"$f":"IF(LIST!G293=\"\",\"\",LIST!G293)","v":""},{"$f":"IF(LIST!E293<>\"\",\"人口銘木AL［\"&LIST!E293 &\"] \"&LIST!F293,\"\")","v":""},{"$f":"IF(LIST!G293=\"\",\"\",LIST!K293)","v":""},{"$f":"IF(LIST!O293=\"\",\"\",LIST!O293)","v":""},{"$f":"IF(LIST!H293=\"\",\"\",IF(LIST!I293=0,\"H\"&LIST!J293,\"W\"&LIST!I293&IF(LIST!J293=0,\"\",\" H\"&LIST!J293)))","v":""}]
[{"$f":"IF(LIST!G294=\"\",\"\",LIST!G294)","v":""},{"$f":"IF(LIST!E294<>\"\",\"人口銘木AL［\"&LIST!E294 &\"] \"&LIST!F294,\"\")","v":""},{"$f":"IF(LIST!G294=\"\",\"\",LIST!K294)","v":""},{"$f":"IF(LIST!O294=\"\",\"\",LIST!O294)","v":""},{"$f":"IF(LIST!H294=\"\",\"\",IF(LIST!I294=0,\"H\"&LIST!J294,\"W\"&LIST!I294&IF(LIST!J294=0,\"\",\" H\"&LIST!J294)))","v":""}]
[{"$f":"IF(LIST!G295=\"\",\"\",LIST!G295)","v":""},{"$f":"IF(LIST!E295<>\"\",\"人口銘木AL［\"&LIST!E295 &\"] \"&LIST!F295,\"\")","v":""},{"$f":"IF(LIST!G295=\"\",\"\",LIST!K295)","v":""},{"$f":"IF(LIST!O295=\"\",\"\",LIST!O295)","v":""},{"$f":"IF(LIST!H295=\"\",\"\",IF(LIST!I295=0,\"H\"&LIST!J295,\"W\"&LIST!I295&IF(LIST!J295=0,\"\",\" H\"&LIST!J295)))","v":""}]
[{"$f":"IF(LIST!G296=\"\",\"\",LIST!G296)","v":""},{"$f":"IF(LIST!E296<>\"\",\"人口銘木AL［\"&LIST!E296 &\"] \"&LIST!F296,\"\")","v":""},{"$f":"IF(LIST!G296=\"\",\"\",LIST!K296)","v":""},{"$f":"IF(LIST!O296=\"\",\"\",LIST!O296)","v":""},{"$f":"IF(LIST!H296=\"\",\"\",IF(LIST!I296=0,\"H\"&LIST!J296,\"W\"&LIST!I296&IF(LIST!J296=0,\"\",\" H\"&LIST!J296)))","v":""}]
[{"$f":"IF(LIST!G297=\"\",\"\",LIST!G297)","v":""},{"$f":"IF(LIST!E297<>\"\",\"人口銘木AL［\"&LIST!E297 &\"] \"&LIST!F297,\"\")","v":""},{"$f":"IF(LIST!G297=\"\",\"\",LIST!K297)","v":""},{"$f":"IF(LIST!O297=\"\",\"\",LIST!O297)","v":""},{"$f":"IF(LIST!H297=\"\",\"\",IF(LIST!I297=0,\"H\"&LIST!J297,\"W\"&LIST!I297&IF(LIST!J297=0,\"\",\" H\"&LIST!J297)))","v":""}]
[{"$f":"IF(LIST!G298=\"\",\"\",LIST!G298)","v":""},{"$f":"IF(LIST!E298<>\"\",\"人口銘木AL［\"&LIST!E298 &\"] \"&LIST!F298,\"\")","v":""},{"$f":"IF(LIST!G298=\"\",\"\",LIST!K298)","v":""},{"$f":"IF(LIST!O298=\"\",\"\",LIST!O298)","v":""},{"$f":"IF(LIST!H298=\"\",\"\",IF(LIST!I298=0,\"H\"&LIST!J298,\"W\"&LIST!I298&IF(LIST!J298=0,\"\",\" H\"&LIST!J298)))","v":""}]
[{"$f":"IF(LIST!G299=\"\",\"\",LIST!G299)","v":""},{"$f":"IF(LIST!E299<>\"\",\"人口銘木AL［\"&LIST!E299 &\"] \"&LIST!F299,\"\")","v":""},{"$f":"IF(LIST!G299=\"\",\"\",LIST!K299)","v":""},{"$f":"IF(LIST!O299=\"\",\"\",LIST!O299)","v":""},{"$f":"IF(LIST!H299=\"\",\"\",IF(LIST!I299=0,\"H\"&LIST!J299,\"W\"&LIST!I299&IF(LIST!J299=0,\"\",\" H\"&LIST!J299)))","v":""}]
[{"$f":"IF(LIST!G300=\"\",\"\",LIST!G300)","v":""},{"$f":"IF(LIST!E300<>\"\",\"人口銘木AL［\"&LIST!E300 &\"] \"&LIST!F300,\"\")","v":""},{"$f":"IF(LIST!G300=\"\",\"\",LIST!K300)","v":""},{"$f":"IF(LIST!O300=\"\",\"\",LIST!O300)","v":""},{"$f":"IF(LIST!H300=\"\",\"\",IF(LIST!I300=0,\"H\"&LIST!J300,\"W\"&LIST!I300&IF(LIST!J300=0,\"\",\" H\"&LIST!J300)))","v":""}]
[{"$f":"IF(LIST!G301=\"\",\"\",LIST!G301)","v":""},{"$f":"IF(LIST!E301<>\"\",\"人口銘木AL［\"&LIST!E301 &\"] \"&LIST!F301,\"\")","v":""},{"$f":"IF(LIST!G301=\"\",\"\",LIST!K301)","v":""},{"$f":"IF(LIST!O301=\"\",\"\",LIST!O301)","v":""},{"$f":"IF(LIST!H301=\"\",\"\",IF(LIST!I301=0,\"H\"&LIST!J301,\"W\"&LIST!I301&IF(LIST!J301=0,\"\",\" H\"&LIST!J301)))","v":""}]
[{"$f":"IF(LIST!G302=\"\",\"\",LIST!G302)","v":""},{"$f":"IF(LIST!E302<>\"\",\"人口銘木AL［\"&LIST!E302 &\"] \"&LIST!F302,\"\")","v":""},{"$f":"IF(LIST!G302=\"\",\"\",LIST!K302)","v":""},{"$f":"IF(LIST!O302=\"\",\"\",LIST!O302)","v":""},{"$f":"IF(LIST!H302=\"\",\"\",IF(LIST!I302=0,\"H\"&LIST!J302,\"W\"&LIST!I302&IF(LIST!J302=0,\"\",\" H\"&LIST!J302)))","v":""}]
[{"$f":"IF(LIST!G303=\"\",\"\",LIST!G303)","v":""},{"$f":"IF(LIST!E303<>\"\",\"人口銘木AL［\"&LIST!E303 &\"] \"&LIST!F303,\"\")","v":""},{"$f":"IF(LIST!G303=\"\",\"\",LIST!K303)","v":""},{"$f":"IF(LIST!O303=\"\",\"\",LIST!O303)","v":""},{"$f":"IF(LIST!H303=\"\",\"\",IF(LIST!I303=0,\"H\"&LIST!J303,\"W\"&LIST!I303&IF(LIST!J303=0,\"\",\" H\"&LIST!J303)))","v":""}]

{"sheet":"価格表","index":8,"n_rows":32,"n_cols":17,"rows_kept":32,"cut":false,"hidden":true,"merged":[]}
[null,null,null,null,null,null,null,null,"KEY","選択サイズ","H","D","単価"]
[null,"人工銘木   価格表 (定価)",null,null,null,null,null,null,{"$f":"VLOOKUP(K2,Table!$F:$H,3,FALSE)&VLOOKUP(L2,Table!$B:$H,7,FALSE)","v":"11"},{"$f":"VLOOKUP(K2,Table!F:G,2,FALSE)&VLOOKUP(L2,Table!B:D,3,FALSE)","v":"06045"},600,450,20000,{"$f":"M2*1.3","v":26000},1,"060",1]
[null,null,null,null,null,null,null,null,{"$f":"VLOOKUP(K3,Table!$F:$H,3,FALSE)&VLOOKUP(L3,Table!$B:$H,7,FALSE)","v":"21"},{"$f":"VLOOKUP(K3,Table!F:G,2,FALSE)&VLOOKUP(L3,Table!B:D,3,FALSE)","v":"07545"},750,450,24500,{"$f":"M3*1.3","v":31850},2,"075",2]
[null,"定価（税抜き）",1,2,3,4,5,6,{"$f":"VLOOKUP(K4,Table!$F:$H,3,FALSE)&VLOOKUP(L4,Table!$B:$H,7,FALSE)","v":"31"},{"$f":"VLOOKUP(K4,Table!F:G,2,FALSE)&VLOOKUP(L4,Table!B:D,3,FALSE)","v":"11045"},1100,450,34000,44200,3,110,3]
[null,null,600,750,1100,1500,1800,2300,{"$f":"VLOOKUP(K5,Table!$F:$H,3,FALSE)&VLOOKUP(L5,Table!$B:$H,7,FALSE)","v":"41"},{"$f":"VLOOKUP(K5,Table!F:G,2,FALSE)&VLOOKUP(L5,Table!B:D,3,FALSE)","v":"15045"},1500,450,44000,57200,4,150,4]
[1,450,20000,24500,34000,44000,50000,64000,{"$f":"VLOOKUP(K6,Table!$F:$H,3,FALSE)&VLOOKUP(L6,Table!$B:$H,7,FALSE)","v":"51"},{"$f":"VLOOKUP(K6,Table!F:G,2,FALSE)&VLOOKUP(L6,Table!B:D,3,FALSE)","v":"18045"},1800,450,50000,65000,5,180,5]
[2,600,23000,28500,40000,52000,59500,76000,{"$f":"VLOOKUP(K7,Table!$F:$H,3,FALSE)&VLOOKUP(L7,Table!$B:$H,7,FALSE)","v":"61"},{"$f":"VLOOKUP(K7,Table!F:G,2,FALSE)&VLOOKUP(L7,Table!B:D,3,FALSE)","v":"23045"},2300,450,64000,83200,6,230]
[3,750,30000,36500,51000,66500,76500,97000,{"$f":"VLOOKUP(K8,Table!$F:$H,3,FALSE)&VLOOKUP(L8,Table!$B:$H,7,FALSE)","v":"12"},{"$f":"VLOOKUP(K8,Table!F:G,2,FALSE)&VLOOKUP(L8,Table!B:D,3,FALSE)","v":"06060"},600,600,23000,29900]
[4,900,35000,43000,61000,79000,90000,116000,{"$f":"VLOOKUP(K9,Table!$F:$H,3,FALSE)&VLOOKUP(L9,Table!$B:$H,7,FALSE)","v":"22"},{"$f":"VLOOKUP(K9,Table!F:G,2,FALSE)&VLOOKUP(L9,Table!B:D,3,FALSE)","v":"07560"},750,600,28500,37050]
[5,1100,37000,45000,64000,83000,95000,121000,{"$f":"VLOOKUP(K10,Table!$F:$H,3,FALSE)&VLOOKUP(L10,Table!$B:$H,7,FALSE)","v":"32"},{"$f":"VLOOKUP(K10,Table!F:G,2,FALSE)&VLOOKUP(L10,Table!B:D,3,FALSE)","v":"11060"},1100,600,40000,52000]
[null,null,null,null,null,null,null,null,{"$f":"VLOOKUP(K11,Table!$F:$H,3,FALSE)&VLOOKUP(L11,Table!$B:$H,7,FALSE)","v":"42"},{"$f":"VLOOKUP(K11,Table!F:G,2,FALSE)&VLOOKUP(L11,Table!B:D,3,FALSE)","v":"15060"},1500,600,52000,67600]
[null,null,null,null,null,null,null,null,{"$f":"VLOOKUP(K12,Table!$F:$H,3,FALSE)&VLOOKUP(L12,Table!$B:$H,7,FALSE)","v":"52"},{"$f":"VLOOKUP(K12,Table!F:G,2,FALSE)&VLOOKUP(L12,Table!B:D,3,FALSE)","v":"18060"},1800,600,59500,77350]
[null,null,null,2300,null,null,null,null,{"$f":"VLOOKUP(K13,Table!$F:$H,3,FALSE)&VLOOKUP(L13,Table!$B:$H,7,FALSE)","v":"62"},{"$f":"VLOOKUP(K13,Table!F:G,2,FALSE)&VLOOKUP(L13,Table!B:D,3,FALSE)","v":"23060"},2300,600,76000,98800]
[null,null,null,1800,null,null,null,null,{"$f":"VLOOKUP(K14,Table!$F:$H,3,FALSE)&VLOOKUP(L14,Table!$B:$H,7,FALSE)","v":"13"},{"$f":"VLOOKUP(K14,Table!F:G,2,FALSE)&VLOOKUP(L14,Table!B:D,3,FALSE)","v":"06075"},600,750,30000,39000]
[null,null,null,1500,null,null,null,null,{"$f":"VLOOKUP(K15,Table!$F:$H,3,FALSE)&VLOOKUP(L15,Table!$B:$H,7,FALSE)","v":"23"},{"$f":"VLOOKUP(K15,Table!F:G,2,FALSE)&VLOOKUP(L15,Table!B:D,3,FALSE)","v":"07575"},750,750,36500,47450]
[null,null,null,1100,null,null,null,null,{"$f":"VLOOKUP(K16,Table!$F:$H,3,FALSE)&VLOOKUP(L16,Table!$B:$H,7,FALSE)","v":"33"},{"$f":"VLOOKUP(K16,Table!F:G,2,FALSE)&VLOOKUP(L16,Table!B:D,3,FALSE)","v":"11075"},1100,750,51000,66300]
[null,null,null,750,null,null,null,null,{"$f":"VLOOKUP(K17,Table!$F:$H,3,FALSE)&VLOOKUP(L17,Table!$B:$H,7,FALSE)","v":"43"},{"$f":"VLOOKUP(K17,Table!F:G,2,FALSE)&VLOOKUP(L17,Table!B:D,3,FALSE)","v":"15075"},1500,750,66500,86450]
[null,null,null,600,null,null,null,null,{"$f":"VLOOKUP(K18,Table!$F:$H,3,FALSE)&VLOOKUP(L18,Table!$B:$H,7,FALSE)","v":"53"},{"$f":"VLOOKUP(K18,Table!F:G,2,FALSE)&VLOOKUP(L18,Table!B:D,3,FALSE)","v":"18075"},1800,750,76500,99450]
[null,null,null,null,null,null,null,null,{"$f":"VLOOKUP(K19,Table!$F:$H,3,FALSE)&VLOOKUP(L19,Table!$B:$H,7,FALSE)","v":"63"},{"$f":"VLOOKUP(K19,Table!F:G,2,FALSE)&VLOOKUP(L19,Table!B:D,3,FALSE)","v":"23075"},2300,750,97000,126100]
[null,null,null,null,null,null,null,null,{"$f":"VLOOKUP(K20,Table!$F:$H,3,FALSE)&VLOOKUP(L20,Table!$B:$H,7,FALSE)","v":"14"},{"$f":"VLOOKUP(K20,Table!F:G,2,FALSE)&VLOOKUP(L20,Table!B:D,3,FALSE)","v":"06090"},600,900,35000,45500]
[null,null,null,null,null,null,null,null,{"$f":"VLOOKUP(K21,Table!$F:$H,3,FALSE)&VLOOKUP(L21,Table!$B:$H,7,FALSE)","v":"24"},{"$f":"VLOOKUP(K21,Table!F:G,2,FALSE)&VLOOKUP(L21,Table!B:D,3,FALSE)","v":"07590"},750,900,43000,55900]
[null,null,null,null,null,null,null,null,{"$f":"VLOOKUP(K22,Table!$F:$H,3,FALSE)&VLOOKUP(L22,Table!$B:$H,7,FALSE)","v":"34"},{"$f":"VLOOKUP(K22,Table!F:G,2,FALSE)&VLOOKUP(L22,Table!B:D,3,FALSE)","v":"11090"},1100,900,61000,79300]
[null,null,null,null,null,null,null,null,{"$f":"VLOOKUP(K23,Table!$F:$H,3,FALSE)&VLOOKUP(L23,Table!$B:$H,7,FALSE)","v":"44"},{"$f":"VLOOKUP(K23,Table!F:G,2,FALSE)&VLOOKUP(L23,Table!B:D,3,FALSE)","v":"15090"},1500,900,79000,102700]
[null,null,null,null,null,null,null,null,{"$f":"VLOOKUP(K24,Table!$F:$H,3,FALSE)&VLOOKUP(L24,Table!$B:$H,7,FALSE)","v":"54"},{"$f":"VLOOKUP(K24,Table!F:G,2,FALSE)&VLOOKUP(L24,Table!B:D,3,FALSE)","v":"18090"},1800,900,90000,117000]
[null,null,null,null,null,null,null,null,{"$f":"VLOOKUP(K25,Table!$F:$H,3,FALSE)&VLOOKUP(L25,Table!$B:$H,7,FALSE)","v":"64"},{"$f":"VLOOKUP(K25,Table!F:G,2,FALSE)&VLOOKUP(L25,Table!B:D,3,FALSE)","v":"23090"},2300,900,116000,150800]
[null,null,null,null,null,null,null,null,{"$f":"VLOOKUP(K26,Table!$F:$H,3,FALSE)&VLOOKUP(L26,Table!$B:$H,7,FALSE)","v":"15"},{"$f":"VLOOKUP(K26,Table!F:G,2,FALSE)&VLOOKUP(L26,Table!B:D,3,FALSE)","v":"060E1"},600,1100,37000,48100]
[null,null,null,null,null,null,null,null,{"$f":"VLOOKUP(K27,Table!$F:$H,3,FALSE)&VLOOKUP(L27,Table!$B:$H,7,FALSE)","v":"25"},{"$f":"VLOOKUP(K27,Table!F:G,2,FALSE)&VLOOKUP(L27,Table!B:D,3,FALSE)","v":"075E1"},750,1100,45000,58500]
[null,null,null,null,null,null,null,null,{"$f":"VLOOKUP(K28,Table!$F:$H,3,FALSE)&VLOOKUP(L28,Table!$B:$H,7,FALSE)","v":"35"},{"$f":"VLOOKUP(K28,Table!F:G,2,FALSE)&VLOOKUP(L28,Table!B:D,3,FALSE)","v":"110E1"},1100,1100,64000,83200]
[null,null,null,null,null,null,null,null,{"$f":"VLOOKUP(K29,Table!$F:$H,3,FALSE)&VLOOKUP(L29,Table!$B:$H,7,FALSE)","v":"45"},{"$f":"VLOOKUP(K29,Table!F:G,2,FALSE)&VLOOKUP(L29,Table!B:D,3,FALSE)","v":"150E1"},1500,1100,83000,107900]
[null,null,null,null,null,null,null,null,{"$f":"VLOOKUP(K30,Table!$F:$H,3,FALSE)&VLOOKUP(L30,Table!$B:$H,7,FALSE)","v":"55"},{"$f":"VLOOKUP(K30,Table!F:G,2,FALSE)&VLOOKUP(L30,Table!B:D,3,FALSE)","v":"180E1"},1800,1100,95000,123500]
[null,null,null,null,null,null,null,null,{"$f":"VLOOKUP(K31,Table!$F:$H,3,FALSE)&VLOOKUP(L31,Table!$B:$H,7,FALSE)","v":"65"},{"$f":"VLOOKUP(K31,Table!F:G,2,FALSE)&VLOOKUP(L31,Table!B:D,3,FALSE)","v":"230E1"},2300,1100,121000,157300]
[null,null,null,null,null,null,null,null,{"$f":"VLOOKUP(K32,Table!$F:$H,3,FALSE)&VLOOKUP(L32,Table!$B:$H,7,FALSE)","v":"77"},"03002",300,200,3000,3900]

{"sheet":"図","index":9,"n_rows":23,"n_cols":49,"rows_kept":23,"cut":false,"hidden":true,"merged":[]}
[null,null,null,1,null,2,null,3,null,4,null,5,null,6,null,7,null,8,null,9,null,1,0,1,1,1,2,1,3,1,4,1,5,1,6,1,7,1,8,1,9,2,0,2,1,2,2,2,3]
[]
[null,1]
[]
[null,2]
[]
[null,3]
[]
[null,4]
[]
[null,5]
[]
[null,6]
[]
[null,7]
[]
[null,8]
[]
[null,9]
[]
[null,10]
[]
[null,11]

{"sheet":"C図","index":10,"n_rows":23,"n_cols":49,"rows_kept":23,"cut":false,"hidden":true,"merged":[]}
[null,null,null,1,null,2,null,3,null,4,null,5,null,6,null,7,null,8,null,9,null,1,0,1,1,1,2,1,3,1,4,1,5,1,6,1,7,1,8,1,9,2,0,2,1,2,2,2,3]
[]
[null,1]
[]
[null,2]
[]
[null,3]
[]
[null,4]
[]
[null,5]
[]
[null,6]
[]
[null,7]
[]
[null,8]
[]
[null,9]
[]
[null,10]
[]
[null,11]

{"sheet":"Cset図","index":11,"n_rows":48,"n_cols":49,"rows_kept":48,"cut":false,"hidden":true,"merged":[]}
[{"$f":"2300+1100+1100","v":4500},null,null,1,null,null,null,null,null,null,null,null,null,null,null,null,null,null,null,null,null,null,null,null,null,null,null,null,null,null,null,null,null,null,null,null,null,null,null,null,null,null,null,null,null,null,null,null,"E"]
[]
[null,1]
[]
[null,2]
[]
[null,3]
[]
[null,4]
[]
[null,5]
[]
[null,6]
[]
[null,7]
[]
[null,8]
[]
[null,9]
[]
[null,10]
[]
[null,11]
[]
[]
[]
[]
[]
[]
[]
[]
[]
[]
[]
[]
[]
[]
[]
[]
[]
[]
[]
[]
[]
[]
[]
[]
[null,"E"]

{"sheet":"CTable","index":12,"n_rows":12,"n_cols":10,"rows_kept":12,"cut":false,"hidden":true,"merged":[]}
[]
[]
["選択","奥行","図形行","記号",null,"巾","記号","Key"]
[0,null,0,null,null,null,null,null,null,450]
[1,450,5,45,null,600,"060",1,null,600]
[2,600,5,60,null,750,"075",2,null,750]
[3,750,6,75,null,1100,110,3,null,900]
[4,900,6,90,null,1500,150,4,null,1100]
[5,1100,7,"E1",null,1800,180,5]
[6,null,null,null,null,2300,230,6]
[7,200,5,20,null,300,"030",7]
[10,null,{"$f":"IF(#REF!=10,VLOOKUP(#REF!,CTable!A5:C9,3,FALSE),0)","v":{"$error":"#REF!"}}]

{"sheet":"C価格表","index":13,"n_rows":32,"n_cols":17,"rows_kept":32,"cut":false,"hidden":true,"merged":[]}
[null,null,null,null,null,null,null,null,"KEY","選択サイズ","W","H","標準単価","単価"]
[null,"人工銘木   価格表 (定価)",null,null,null,"コーナー",10000,null,{"$f":"MATCH(K2,$C$12:$C$18,-1)&MATCH(L2,$D$12:$D$18,-1)","v":"65"},{"$f":"VLOOKUP(K2,CTable!F:G,2,FALSE)&VLOOKUP(L2,CTable!B:D,3,FALSE)","v":"06045"},600,450,20000,{"$f":"M2*1.5+$G$2","v":40000}]
[null,null,null,null,null,null,null,null,"55",{"$f":"VLOOKUP(K3,CTable!F:G,2,FALSE)&VLOOKUP(L3,CTable!B:D,3,FALSE)","v":"07545"},750,450,24500,{"$f":"M3*1.5+$G$2","v":46750},null,"特注記号","倍率"]
[null,"定価（税抜き）",null,null,null,null,null,null,"45",{"$f":"VLOOKUP(K4,CTable!F:G,2,FALSE)&VLOOKUP(L4,CTable!B:D,3,FALSE)","v":"11045"},1100,450,34000,61000,null,"D",1.3]
[null,null,600,750,1100,1500,1800,2300,"35",{"$f":"VLOOKUP(K5,CTable!F:G,2,FALSE)&VLOOKUP(L5,CTable!B:D,3,FALSE)","v":"15045"},1500,450,44000,76000,null,"W",1.3]
[null,450,20000,24500,34000,44000,50000,64000,"25",{"$f":"VLOOKUP(K6,CTable!F:G,2,FALSE)&VLOOKUP(L6,CTable!B:D,3,FALSE)","v":"18045"},1800,450,50000,85000,null,"Z",1.5]
[null,600,23000,28500,40000,52000,59500,76000,"15",{"$f":"VLOOKUP(K7,CTable!F:G,2,FALSE)&VLOOKUP(L7,CTable!B:D,3,FALSE)","v":"23045"},2300,450,64000,106000,null,"N",1]
[null,750,30000,36500,51000,66500,76500,97000,"64",{"$f":"VLOOKUP(K8,CTable!F:G,2,FALSE)&VLOOKUP(L8,CTable!B:D,3,FALSE)","v":"06060"},600,600,23000,44500]
[null,900,35000,43000,61000,79000,90000,116000,"54",{"$f":"VLOOKUP(K9,CTable!F:G,2,FALSE)&VLOOKUP(L9,CTable!B:D,3,FALSE)","v":"07560"},750,600,28500,52750]
[null,1100,37000,45000,64000,83000,95000,121000,"44",{"$f":"VLOOKUP(K10,CTable!F:G,2,FALSE)&VLOOKUP(L10,CTable!B:D,3,FALSE)","v":"11060"},1100,600,40000,70000]
[null,null,"W","H","W記号","H記号",null,null,"34",{"$f":"VLOOKUP(K11,CTable!F:G,2,FALSE)&VLOOKUP(L11,CTable!B:D,3,FALSE)","v":"15060"},1500,600,52000,88000]
[null,1,2300,1100,230,"E1",null,null,"24",{"$f":"VLOOKUP(K12,CTable!F:G,2,FALSE)&VLOOKUP(L12,CTable!B:D,3,FALSE)","v":"18060"},1800,600,59500,99250]
[null,2,1800,900,180,90,null,null,"14",{"$f":"VLOOKUP(K13,CTable!F:G,2,FALSE)&VLOOKUP(L13,CTable!B:D,3,FALSE)","v":"23060"},2300,600,76000,124000]
[null,3,1500,750,150,75,null,null,"63",{"$f":"VLOOKUP(K14,CTable!F:G,2,FALSE)&VLOOKUP(L14,CTable!B:D,3,FALSE)","v":"06075"},600,750,30000,55000]
[null,4,1100,600,110,60,null,null,"53",{"$f":"VLOOKUP(K15,CTable!F:G,2,FALSE)&VLOOKUP(L15,CTable!B:D,3,FALSE)","v":"07575"},750,750,36500,64750]
[null,5,750,450,"075",45,null,null,"43",{"$f":"VLOOKUP(K16,CTable!F:G,2,FALSE)&VLOOKUP(L16,CTable!B:D,3,FALSE)","v":"11075"},1100,750,51000,86500]
[null,6,600,0,"060",null,null,null,"33",{"$f":"VLOOKUP(K17,CTable!F:G,2,FALSE)&VLOOKUP(L17,CTable!B:D,3,FALSE)","v":"15075"},1500,750,66500,109750]
[null,7,0,null,null,null,null,null,"23",{"$f":"VLOOKUP(K18,CTable!F:G,2,FALSE)&VLOOKUP(L18,CTable!B:D,3,FALSE)","v":"18075"},1800,750,76500,124750]
[null,null,null,null,null,null,null,null,"13",{"$f":"VLOOKUP(K19,CTable!F:G,2,FALSE)&VLOOKUP(L19,CTable!B:D,3,FALSE)","v":"23075"},2300,750,97000,155500]
[null,null,null,null,null,null,null,null,"62",{"$f":"VLOOKUP(K20,CTable!F:G,2,FALSE)&VLOOKUP(L20,CTable!B:D,3,FALSE)","v":"06090"},600,900,35000,62500]
[null,null,null,null,null,null,null,null,"52",{"$f":"VLOOKUP(K21,CTable!F:G,2,FALSE)&VLOOKUP(L21,CTable!B:D,3,FALSE)","v":"07590"},750,900,43000,74500]
[null,null,null,null,null,null,null,null,"42",{"$f":"VLOOKUP(K22,CTable!F:G,2,FALSE)&VLOOKUP(L22,CTable!B:D,3,FALSE)","v":"11090"},1100,900,61000,101500]
[null,null,null,null,null,null,null,null,"32",{"$f":"VLOOKUP(K23,CTable!F:G,2,FALSE)&VLOOKUP(L23,CTable!B:D,3,FALSE)","v":"15090"},1500,900,79000,128500]
[null,null,null,null,null,null,null,null,"22",{"$f":"VLOOKUP(K24,CTable!F:G,2,FALSE)&VLOOKUP(L24,CTable!B:D,3,FALSE)","v":"18090"},1800,900,90000,145000]
[null,null,null,null,null,null,null,null,"12",{"$f":"VLOOKUP(K25,CTable!F:G,2,FALSE)&VLOOKUP(L25,CTable!B:D,3,FALSE)","v":"23090"},2300,900,116000,184000]
[null,null,null,null,null,null,null,null,"61",{"$f":"VLOOKUP(K26,CTable!F:G,2,FALSE)&VLOOKUP(L26,CTable!B:D,3,FALSE)","v":"060E1"},600,1100,37000,65500]
[null,null,null,null,null,null,null,null,"51",{"$f":"VLOOKUP(K27,CTable!F:G,2,FALSE)&VLOOKUP(L27,CTable!B:D,3,FALSE)","v":"075E1"},750,1100,45000,77500]
[null,null,null,null,null,null,null,null,"41",{"$f":"VLOOKUP(K28,CTable!F:G,2,FALSE)&VLOOKUP(L28,CTable!B:D,3,FALSE)","v":"110E1"},1100,1100,64000,106000]
[null,null,null,null,null,null,null,null,"31",{"$f":"VLOOKUP(K29,CTable!F:G,2,FALSE)&VLOOKUP(L29,CTable!B:D,3,FALSE)","v":"150E1"},1500,1100,83000,134500]
[null,null,null,null,null,null,null,null,"21",{"$f":"VLOOKUP(K30,CTable!F:G,2,FALSE)&VLOOKUP(L30,CTable!B:D,3,FALSE)","v":"180E1"},1800,1100,95000,152500]
[null,null,null,null,null,null,null,null,"11",{"$f":"VLOOKUP(K31,CTable!F:G,2,FALSE)&VLOOKUP(L31,CTable!B:D,3,FALSE)","v":"230E1"},2300,1100,121000,191500]
[null,null,null,null,null,null,null,null,"65","03002",300,200,3000,14500]

{"sheet":"木口形状","index":14,"n_rows":4,"n_cols":3,"rows_kept":4,"cut":false,"hidden":true,"merged":[]}
[]
[null,"波形(耳付き)","W"]
[null,"テーパー","T"]
[null,"垂直","S"]

{"sheet":"設定","index":15,"n_rows":4,"n_cols":3,"rows_kept":4,"cut":false,"hidden":true,"merged":[]}
[]
[null,"設定"]
[]
[null,"メンテモード",false]