{"text_format":"1","workbook":"xlsx","n_sheets":16,"sheets":["Table","製品選択","標準","組合せコーナーSET","一体コーナー","LIST","図面LIST","csv","価格表","図","C図","Cset図","CTable","C価格表","木口形状","設定"],"not_rendered":{"charts":0,"images":29,"macros":1,"external_links":0,"defined_names":19,"comments":0,"pivot_tables":0},"unopened":[],"bounds":{"document_bytes":16777216,"sheet_cells":100000,"rows_first":2000,"rows_last":500,"rows_between":2000,"halvings":0,"cell_chars":16384,"cell_head_chars":4096},"cells_cut":0,"cells_raw":0,"read":"whole","date_system":"1900"}

{"sheet":"Table","index":0,"n_rows":12,"n_cols":10,"rows_kept":12,"cut":false,"hidden":true,"merged":[]}
[]
[]
["選択","奥行","図形行","記号",null,"巾","記号","Key"]
[0,null,0,null,null,null,null,null,null,450]
[1,450,5,45,null,600,"060",1,null,600]
[2,600,5,60,null,750,"075",2,null,750]
[3,750,6,75,null,1100,110,3,null,900]
[4,900,6,90,null,1500,150,4,null,1100]
[5,1100,7,"E1",null,1800,180,5]
[6,null,null,null,null,2300,230,6]
[7,200,5,20,null,300,"030",7]
[10,null,{"$f":"IF(#REF!=10,VLOOKUP(#REF!,Table!A5:C9,3,FALSE),0)","v":{"$error":"#REF!"}}]

{"sheet":"製品選択","index":1,"n_rows":0,"n_cols":0,"rows_kept":0,"cut":false,"hidden":false,"merged":[[8,4,8,6],[8,7,8,10]]}

{"sheet":"標準","index":2,"n_rows":140,"n_cols":23,"rows_kept":140,"cut":false,"hidden":false,"merged":[[1,10,1,11],[140,10,140,11],[123,8,123,11]]}
[null,null,"CBOX","ヨコ","タテ","形状","色",null,null,null,"標準　長方形"]
[null,null,{"$f":"C134","v":0},{"$f":"E111","v":{"$error":"#N/A"}},{"$f":"E115","v":{"$error":"#N/A"}},{"$f":"E117","v":0},{"$f":"E120","v":0},null,"品  番",null,{"$f":"IF(AND(H9,V9<>\"\"),O98,\"\")","v":""},null,"金額",{"$f":"T98","v":""}]
[]
[null,"hide","hide","hide","hide","hide","hide",null,null,null,null,null,null,null,null,null,null,"hide",null,null,"hide"]
["hide"]
["hide"]
["hide"]
["hide"]
["hide",null,null,null,null,null,null,{"$f":"COUNTIF($H$103:$H$120,\"✔\")>=5","v":false},null,null,null,null,null,null,null,null,null,null,null,null,null,true]
[null,null,"最終値","選択値","記号","計算用","デフォルト値"]
["hide"]
["hide"]
["hide"]
["hide"]
["hide"]
["hide"]
["hide"]
["hide"]
["hide"]
["hide"]
{"$rows_left_out":121}
{"sheet":"組合せコーナーSET","index":3,"n_rows":127,"n_cols":21,"rows_kept":127,"cut":false,"hidden":false,"merged":[[126,11,126,12],[0,10,0,12],[107,8,107,9],[115,8,115,9],[111,8,111,9],[113,8,113,9],[105,8,105,9],[1,11,1,12],[109,8,109,9],[117,8,117,9],[123,7,123,11],[119,8,119,9],[121,8,121,9],[103,8,103,9]]}
[null,null,"CBOX","ヨコ","タテ","形状","色",null,null,null,"組合せ コーナーカウンター\n45°カット"]
[null,null,null,{"$f":"L106","v":2300},{"$f":"L111","v":0},null,{"$f":"E127","v":0},null,null,null,"金額",{"$f":"IF(T96,IFERROR(SUM(U98:U101),\"\"),\"\")","v":""}]
[]
[null,"hide","hide","hide","hide","hide","hide"]
["hide",null,"最終値","選択値","記号","計算用","デフォルト値"]
["hide"]
["hide"]
["hide"]
["hide",null,null,null,null,null,null,{"$f":"COUNTIF(H102:H127,\"✔\")=11","v":false}]
["hide"]
["hide"]
["hide"]
["hide"]
["hide"]
["hide"]
["hide"]
["hide"]
["hide"]
["hide"]
["hide"]
{"$rows_left_out":108}
{"sheet":"一体コーナー","index":4,"n_rows":26,"n_cols":32,"rows_kept":26,"cut":false,"hidden":false,"merged":[[25,4,25,5],[4,1,4,2],[4,23,4,24],[6,1,8,2],[11,16,11,18],[20,8,21,9]]}
[null,"　一体型　コーナーカウンター　",null,null,null,null,null,null,null,null,null,null,null,null,null,"✔数",{"$f":"COUNTIF(A11:A27,\"✔\")","v":0}]
[null,null,null,null,null,null,null,null,null,null,null,null,null,null,null,null,"標準サイズ",{"$f":"VLOOKUP(INT(LEFT(Q3,1)),C価格表!B11:C18,2,FALSE)","v":0},{"$f":"VLOOKUP(INT(RIGHT(Q3,1)),C価格表!B11:D18,3,FALSE)","v":0}]
[null,null,null,null,null,null,null,null,null,null,null,null,null,null,null,null,{"$f":"MATCH(R8,C価格表!C12:C19,-1)&MATCH(MAX(Q10:S10),C価格表!D12:D18,-1)","v":"76"},{"$f":"VLOOKUP(INT(LEFT(Q3,1)),C価格表!$B$11:$F$18,4,FALSE)","v":0},{"$f":"VLOOKUP(INT(RIGHT(Q3,1)),C価格表!$B$11:$F$18,5,FALSE)","v":0},null,{"$f":"A25","v":0}]
[]
[null,"金額",null,null,null,null,null,null,null,null,null,null,null,null,null,null,"No","幅長","奥行","形状","色","品番","特","特注size",null,"数量","単価","金額","単価","数量","金額","メモ"]
[null,null,null,null,null,null,null,null,null,null,null,null,null,null,null,null,1,{"$f":"D18","v":0},{"$f":"MAX(D15,D19,D20)","v":0},{"$f":"\"一体\"&T8&U8&V8&W8","v":"一体SSSS"},{"$f":"IF(A25=\"NO\",\"ナチュラルオーク\",\"ダークオーク\")","v":"ダークオーク"},{"$f":"\"AH\"&R3&S3&T8&V8&U8&W8&U3&\"0Z\"","v":"AH00SSSS00Z"},{"$f":"TEXT(D18,\"0000-\")&TEXT(D15,\"0000-\")&TEXT(D16,\"0000-\")&TEXT(D19,\"0000-\")&TEXT(D17,\"0000-\")&TEXT(D20,\"0000-\")&TEXT(D21,\"0000-\")&TEXT(D22,\"0000-\")&A25&\"-\"&T8&U8&V8&W8","v":"0000-0000-0000-0000-0000-0000-0000-0000--SSSS"},{"$f":"IF(W11=3,\"一体型コの字カウンター\",\"一体型L字カウンター\")","v":"一体型コの字カウンター"},null,1,{"$f":"VLOOKUP(Q3,C価格表!I:N,6,FALSE)","v":{"$error":"#N/A"}}]
[null,"レイアウト",null,null,null,null,null,null,null,null,null,null,null,null,null,"②","５WL","１WC","６WR","形状内側","形状外側","形状左","形状右",null,"色"]
[null,null,null,null,null,null,null,null,null,null,null,null,null,null,null,{"$f":"IF(W11=2,0,D13)","v":0},{"$f":"IF(W11=2,0,IF(P8=0,0,D16))","v":0},{"$f":"Q12-Q8-S8","v":0},{"$f":"IF(W11=1,0,IF(P10=0,0,D17))","v":0},"S",{"$f":"IFERROR(VLOOKUP(F18,T16:V18,3,FALSE),\"S\")","v":"S"},{"$f":"IFERROR(VLOOKUP(F16,T16:V18,3,FALSE),\"S\")","v":"S"},{"$f":"IFERROR(VLOOKUP(F17,T16:V18,3,FALSE),\"S\")","v":"S"},null,{"$f":"A25","v":0}]
[null,null,null,null,null,null,null,null,null,null,null,null,null,null,null,"③","８DL","４DC","９DR","~1100"]
[null,null,null,"数値を入力",null,"木口形状を選択",null,null,null,null,null,null,null,null,null,{"$f":"IF(W11=1,0,D14)","v":0},{"$f":"D19","v":0},{"$f":"D15","v":0},{"$f":"D20","v":0},null,"重量",null,"形状"]
[null,"記号",null,"サイズ　mm","max.","木口選択",null,null,null,null,null,null,null,null,null,null,null,"７WT","~2300",null,{"$f":"(Q8*Q10+R10*(Q12-Q8-S8)+S8*S10)*30*0.7/10/10/10/1000","v":0},null,3]
[{"$f":"IF(D12=0,\"\",IF(D12>E12,\"\",\"✔\"))","v":""},"①","内幅",null,{"$f":"IF(W11=1,2300-D16,IF(W11=2,2300-D17,2300-D16-D17))","v":2300}," 垂直",null,null,null,null,null,null,null,null,null,null,{"$f":"D18","v":0}]
[{"$f":"IF(W11=2,\"✔\",IF(P8=0,\"\",IF(D13>E13,\"\",\"✔\")))","v":""},"②","左内奥行",null,{"$f":"1100-D15","v":1100},{"$f":"IF(F12=0,\"\",F12)","v":" 垂直"},null,null,null,null,null,null,null,null,null,null,"RL",null,"RR","~1100"]
[{"$f":"IF(W11=1,\"✔\",IF(P10=0,\"\",IF(D14>E14,\"\",\"✔\")))","v":""},"③","右内奥行",null,{"$f":"1100-D15","v":1100}," 垂直",null,null,null,null,null,null,null,null,null,null,{"$f":"D21","v":0},null,{"$f":"D22","v":0}]
[{"$f":"IF(D15=0,\"\",IF(D15>E15,\"\",\"✔\"))","v":""},"④","前奥行",null,{"$f":"1100-MAX(P8,P10)","v":1100}]
[{"$f":"IF(OR(D16=\"\",F16=\"\"),\"\",IF(D16>E16,\"\",\"✔\"))","v":""},"⑤",{"$f":"IF(W11=2,\"左辺形状\",\"左幅\")","v":"左幅"},null,{"$f":"IF(W11=1,2300-D12,IF(W11=2,1100-D14,2300-D12-D17))","v":2300},null,null,null,null,null,null,null,null,null,null,null,null,null,null,1,"波形(耳付き)","W"]
[{"$f":"IF(OR(D17=\"\",F17=\"\"),\"\",IF(D17>E17,\"\",\"✔\"))","v":""},"⑥",{"$f":"IF(W11=1,\"右辺形状\",\"右幅\")","v":"右幅"},null,{"$f":"IF(W11=1,E15,IF(W11=2,2300-D12,2300-D12-D16))","v":2300},null,null,null,null,null,null,null,null,null,null,null,null,null,null,2,"テーパー","T"]
[{"$f":"IF(NOT(ISNUMBER(D18)),\"\",IF(OR(D18=0,F18=\"\"),\"\",\"✔\"))","v":""},"⑦","全幅",{"$f":"IF(D12+IF(P8=0,0,D16)+IF(P10=0,0,D17)>E18,\"最大値エラー\",D12+IF(P8=0,0,D16)+IF(P10=0,0,D17))","v":0},2300,null,null,null,null,null,null,null,null,null,null,null,null,null,null,3,"垂直","S"]
[{"$f":"IF(NOT(ISNUMBER(D19)),\"\",IF(OR(D19=0,F19=\"\"),\"\",\"✔\"))","v":""},"⑧","左奥行",{"$f":"IF(P8=0,D15,IF(P8+D15>E19,\"最大値エラー\",P8+D15))","v":0},1100,{"$f":"\" \"&IFERROR(VLOOKUP(F18,$T$16:$U$18,2,FALSE),\"\")","v":" "}]
[{"$f":"IF(NOT(ISNUMBER(D20)),\"\",IF(OR(D20=0,F20=\"\"),\"\",\"✔\"))","v":""},"⑨","右奥行",{"$f":"IF(P10=0,D15,IF(P10+D15>E20,\"最大値エラー\",P10+D15))","v":0},1100,{"$f":"F19","v":" "}]
{"$rows_left_out":7}
{"sheet":"LIST","index":5,"n_rows":48,"n_cols":17,"rows_kept":48,"cut":false,"hidden":false,"merged":[[2,1,2,3],[3,1,3,3],[3,9,3,12],[2,9,2,12],[4,9,4,12]]}
[null,"見積リスト",null,null,null,null,"お客様"]
[null,null,null,null,null,null,0.32]
[null,"受注日",null,null,{"$f":"TODAY()","v":"2025-10-09"},"納入場所",null,null,"〒"]
[null,"注文番号",null,null,null,"注文名",null,null,"住所"]
[null,"納  期",null,null,null,"金額合計",{"$f":"M9","v":0},null,"電話番号"]
[null,null,null,null,null,null,null,null,null,null,null,"上代金額"]
[]
[]
[null,null,null,null,null,null,null,null,null,null,{"$f":"SUM(K11:K1048576)","v":0},null,{"$f":"SUM(M11:M1048576)","v":0},"合計",{"$f":"SUM(O11:O1048576)","v":0}]
["選択","No","幅長","奥行","形状","色","品番","特","品名","備考（任意入力）","数量","定価","金額","単価","金額","メモ","図番"]
["□"]
["□"]
["□"]
["□"]
["□"]
["□"]
["□"]
["□"]
["□"]
["□"]
{"$rows_left_out":29}
{"sheet":"図面LIST","index":6,"n_rows":10,"n_cols":3,"rows_kept":10,"cut":false,"hidden":false,"merged":[]}
[]
[null,"イメージ図 リスト"]
[null,"受注日",{"$f":"LIST!E3","v":"2025-10-09"}]
[null,"注文No",{"$f":"IF(LIST!E4=0,\"\",LIST!E4)","v":""}]
[null,"納期",{"$f":"IF(LIST!E5=0,\"\",LIST!E5)","v":""}]
[null,"納入場所",{"$f":"IF(LIST!G3=0,\"\",LIST!G3)","v":""}]
[null,"注文名",{"$f":"IF(LIST!G4=0,\"\",LIST!G4)","v":""}]
[null,"合計金額",{"$f":"LIST!G5","v":0}]
[]
[null,"図番"]

{"sheet":"csv","index":7,"n_rows":300,"n_cols":5,"rows_kept":300,"cut":false,"hidden":true,"merged":[]}
[{"$f":"LIST!$G$4","v":0}]
[{"$f":"LIST!$E$4","v":0}]
[{"$f":"IF(LIST!G6=\"\",\"\",LIST!G6)","v":""},{"$f":"IF(LIST!E6<>\"\",\"人口銘木AL［\"&LIST!E6 &\"] \"&LIST!F6,\"\")","v":""},{"$f":"IF(LIST!G6=\"\",\"\",LIST!K6)","v":""},{"$f":"IF(LIST!O6=\"\",\"\",LIST!O6)","v":""},{"$f":"IF(LIST!H6=\"\",\"\",IF(LIST!I6=0,\"H\"&LIST!J6,\"W\"&LIST!I6&IF(LIST!J6=0,\"\",\" H\"&LIST!J6)))","v":""}]
[{"$f":"IF(LIST!G7=\"\",\"\",LIST!G7)","v":""},{"$f":"IF(LIST!E7<>\"\",\"人口銘木AL［\"&LIST!E7 &\"] \"&LIST!F7,\"\")","v":""},{"$f":"IF(LIST!G7=\"\",\"\",LIST!K7)","v":""},{"$f":"IF(LIST!O7=\"\",\"\",LIST!O7)","v":""},{"$f":"IF(LIST!H7=\"\",\"\",IF(LIST!I7=0,\"H\"&LIST!J7,\"W\"&LIST!I7&IF(LIST!J7=0,\"\",\" H\"&LIST!J7)))","v":""}]
[{"$f":"IF(LIST!G8=\"\",\"\",LIST!G8)","v":""},{"$f":"IF(LIST!E8<>\"\",\"人口銘木AL［\"&LIST!E8 &\"] \"&LIST!F8,\"\")","v":""},{"$f":"IF(LIST!G8=\"\",\"\",LIST!K8)","v":""},{"$f":"IF(LIST!O8=\"\",\"\",LIST!O8)","v":""},{"$f":"IF(LIST!H8=\"\",\"\",IF(LIST!I8=0,\"H\"&LIST!J8,\"W\"&LIST!I8&IF(LIST!J8=0,\"\",\" H\"&LIST!J8)))","v":""}]
[{"$f":"IF(LIST!G9=\"\",\"\",LIST!G9)","v":""},{"$f":"IF(LIST!E9<>\"\",\"人口銘木AL［\"&LIST!E9 &\"] \"&LIST!F9,\"\")","v":""},{"$f":"IF(LIST!G9=\"\",\"\",LIST!K9)","v":""},null,{"$f":"IF(LIST!H9=\"\",\"\",IF(LIST!I9=0,\"H\"&LIST!J9,\"W\"&LIST!I9&IF(LIST!J9=0,\"\",\" H\"&LIST!J9)))","v":""}]
[{"$f":"IF(LIST!G10=\"\",\"\",LIST!G10)","v":"品番"},{"$f":"IF(LIST!E10<>\"\",\"人口銘木AL［\"&LIST!E10 &\"] \"&LIST!F10,\"\")","v":"人口銘木AL［形状] 色"},{"$f":"IF(LIST!G10=\"\",\"\",LIST!K10)","v":"数量"},{"$f":"IF(LIST!O10=\"\",\"\",LIST!O10)","v":"金額"},{"$f":"IF(LIST!H10=\"\",\"\",IF(LIST!I10=0,\"H\"&LIST!J10,\"W\"&LIST!I10&IF(LIST!J10=0,\"\",\" H\"&LIST!J10)))","v":"W品名 H備考（任意入力）"}]
[{"$f":"IF(LIST!G11=\"\",\"\",LIST!G11)","v":""},{"$f":"IF(LIST!E11<>\"\",\"人口銘木AL［\"&LIST!E11 &\"] \"&LIST!F11,\"\")","v":""},{"$f":"IF(LIST!G11=\"\",\"\",LIST!K11)","v":""},{"$f":"IF(LIST!O11=\"\",\"\",LIST!O11)","v":""},{"$f":"IF(LIST!H11=\"\",\"\",IF(LIST!I11=0,\"H\"&LIST!J11,\"W\"&LIST!I11&IF(LIST!J11=0,\"\",\" H\"&LIST!J11)))","v":""}]
[{"$f":"IF(LIST!G12=\"\",\"\",LIST!G12)","v":""},{"$f":"IF(LIST!E12<>\"\",\"人口銘木AL［\"&LIST!E12 &\"] \"&LIST!F12,\"\")","v":""},{"$f":"IF(LIST!G12=\"\",\"\",LIST!K12)","v":""},{"$f":"IF(LIST!O12=\"\",\"\",LIST!O12)","v":""},{"$f":"IF(LIST!H12=\"\",\"\",IF(LIST!I12=0,\"H\"&LIST!J12,\"W\"&LIST!I12&IF(LIST!J12=0,\"\",\" H\"&LIST!J12)))","v":""}]
[{"$f":"IF(LIST!G13=\"\",\"\",LIST!G13)","v":""},{"$f":"IF(LIST!E13<>\"\",\"人口銘木AL［\"&LIST!E13 &\"] \"&LIST!F13,\"\")","v":""},{"$f":"IF(LIST!G13=\"\",\"\",LIST!K13)","v":""},{"$f":"IF(LIST!O13=\"\",\"\",LIST!O13)","v":""},{"$f":"IF(LIST!H13=\"\",\"\",IF(LIST!I13=0,\"H\"&LIST!J13,\"W\"&LIST!I13&IF(LIST!J13=0,\"\",\" H\"&LIST!J13)))","v":""}]
[{"$f":"IF(LIST!G14=\"\",\"\",LIST!G14)","v":""},{"$f":"IF(LIST!E14<>\"\",\"人口銘木AL［\"&LIST!E14 &\"] \"&LIST!F14,\"\")","v":""},{"$f":"IF(LIST!G14=\"\",\"\",LIST!K14)","v":""},{"$f":"IF(LIST!O14=\"\",\"\",LIST!O14)","v":""},{"$f":"IF(LIST!H14=\"\",\"\",IF(LIST!I14=0,\"H\"&LIST!J14,\"W\"&LIST!I14&IF(LIST!J14=0,\"\",\" H\"&LIST!J14)))","v":""}]
[{"$f":"IF(LIST!G15=\"\",\"\",LIST!G15)","v":""},{"$f":"IF(LIST!E15<>\"\",\"人口銘木AL［\"&LIST!E15 &\"] \"&LIST!F15,\"\")","v":""},{"$f":"IF(LIST!G15=\"\",\"\",LIST!K15)","v":""},{"$f":"IF(LIST!O15=\"\",\"\",LIST!O15)","v":""},{"$f":"IF(LIST!H15=\"\",\"\",IF(LIST!I15=0,\"H\"&LIST!J15,\"W\"&LIST!I15&IF(LIST!J15=0,\"\",\" H\"&LIST!J15)))","v":""}]
[{"$f":"IF(LIST!G16=\"\",\"\",LIST!G16)","v":""},{"$f":"IF(LIST!E16<>\"\",\"人口銘木AL［\"&LIST!E16 &\"] \"&LIST!F16,\"\")","v":""},{"$f":"IF(LIST!G16=\"\",\"\",LIST!K16)","v":""},{"$f":"IF(LIST!O16=\"\",\"\",LIST!O16)","v":""},{"$f":"IF(LIST!H16=\"\",\"\",IF(LIST!I16=0,\"H\"&LIST!J16,\"W\"&LIST!I16&IF(LIST!J16=0,\"\",\" H\"&LIST!J16)))","v":""}]
[{"$f":"IF(LIST!G17=\"\",\"\",LIST!G17)","v":""},{"$f":"IF(LIST!E17<>\"\",\"人口銘木AL［\"&LIST!E17 &\"] \"&LIST!F17,\"\")","v":""},{"$f":"IF(LIST!G17=\"\",\"\",LIST!K17)","v":""},{"$f":"IF(LIST!O17=\"\",\"\",LIST!O17)","v":""},{"$f":"IF(LIST!H17=\"\",\"\",IF(LIST!I17=0,\"H\"&LIST!J17,\"W\"&LIST!I17&IF(LIST!J17=0,\"\",\" H\"&LIST!J17)))","v":""}]
[{"$f":"IF(LIST!G18=\"\",\"\",LIST!G18)","v":""},{"$f":"IF(LIST!E18<>\"\",\"人口銘木AL［\"&LIST!E18 &\"] \"&LIST!F18,\"\")","v":""},{"$f":"IF(LIST!G18=\"\",\"\",LIST!K18)","v":""},{"$f":"IF(LIST!O18=\"\",\"\",LIST!O18)","v":""},{"$f":"IF(LIST!H18=\"\",\"\",IF(LIST!I18=0,\"H\"&LIST!J18,\"W\"&LIST!I18&IF(LIST!J18=0,\"\",\" H\"&LIST!J18)))","v":""}]
[{"$f":"IF(LIST!G19=\"\",\"\",LIST!G19)","v":""},{"$f":"IF(LIST!E19<>\"\",\"人口銘木AL［\"&LIST!E19 &\"] \"&LIST!F19,\"\")","v":""},{"$f":"IF(LIST!G19=\"\",\"\",LIST!K19)","v":""},{"$f":"IF(LIST!O19=\"\",\"\",LIST!O19)","v":""},{"$f":"IF(LIST!H19=\"\",\"\",IF(LIST!I19=0,\"H\"&LIST!J19,\"W\"&LIST!I19&IF(LIST!J19=0,\"\",\" H\"&LIST!J19)))","v":""}]
[{"$f":"IF(LIST!G20=\"\",\"\",LIST!G20)","v":""},{"$f":"IF(LIST!E20<>\"\",\"人口銘木AL［\"&LIST!E20 &\"] \"&LIST!F20,\"\")","v":""},{"$f":"IF(LIST!G20=\"\",\"\",LIST!K20)","v":""},{"$f":"IF(LIST!O20=\"\",\"\",LIST!O20)","v":""},{"$f":"IF(LIST!H20=\"\",\"\",IF(LIST!I20=0,\"H\"&LIST!J20,\"W\"&LIST!I20&IF(LIST!J20=0,\"\",\" H\"&LIST!J20)))","v":""}]
[{"$f":"IF(LIST!G21=\"\",\"\",LIST!G21)","v":""},{"$f":"IF(LIST!E21<>\"\",\"人口銘木AL［\"&LIST!E21 &\"] \"&LIST!F21,\"\")","v":""},{"$f":"IF(LIST!G21=\"\",\"\",LIST!K21)","v":""},{"$f":"IF(LIST!O21=\"\",\"\",LIST!O21)","v":""},{"$f":"IF(LIST!H21=\"\",\"\",IF(LIST!I21=0,\"H\"&LIST!J21,\"W\"&LIST!I21&IF(LIST!J21=0,\"\",\" H\"&LIST!J21)))","v":""}]
[{"$f":"IF(LIST!G22=\"\",\"\",LIST!G22)","v":""},{"$f":"IF(LIST!E22<>\"\",\"人口銘木AL［\"&LIST!E22 &\"] \"&LIST!F22,\"\")","v":""},{"$f":"IF(LIST!G22=\"\",\"\",LIST!K22)","v":""},{"$f":"IF(LIST!O22=\"\",\"\",LIST!O22)","v":""},{"$f":"IF(LIST!H22=\"\",\"\",IF(LIST!I22=0,\"H\"&LIST!J22,\"W\"&LIST!I22&IF(LIST!J22=0,\"\",\" H\"&LIST!J22)))","v":""}]
[{"$f":"IF(LIST!G23=\"\",\"\",LIST!G23)","v":""},{"$f":"IF(LIST!E23<>\"\",\"人口銘木AL［\"&LIST!E23 &\"] \"&LIST!F23,\"\")","v":""},{"$f":"IF(LIST!G23=\"\",\"\",LIST!K23)","v":""},{"$f":"IF(LIST!O23=\"\",\"\",LIST!O23)","v":""},{"$f":"IF(LIST!H23=\"\",\"\",IF(LIST!I23=0,\"H\"&LIST!J23,\"W\"&LIST!I23&IF(LIST!J23=0,\"\",\" H\"&LIST!J23)))","v":""}]
{"$rows_left_out":281}
{"sheet":"価格表","index":8,"n_rows":32,"n_cols":17,"rows_kept":32,"cut":false,"hidden":true,"merged":[]}
[null,null,null,null,null,null,null,null,"KEY","選択サイズ","H","D","単価"]
[null,"人工銘木   価格表 (定価)",null,null,null,null,null,null,{"$f":"VLOOKUP(K2,Table!$F:$H,3,FALSE)&VLOOKUP(L2,Table!$B:$H,7,FALSE)","v":"11"},{"$f":"VLOOKUP(K2,Table!F:G,2,FALSE)&VLOOKUP(L2,Table!B:D,3,FALSE)","v":"06045"},600,450,20000,{"$f":"M2*1.3","v":26000},1,"060",1]
[null,null,null,null,null,null,null,null,{"$f":"VLOOKUP(K3,Table!$F:$H,3,FALSE)&VLOOKUP(L3,Table!$B:$H,7,FALSE)","v":"21"},{"$f":"VLOOKUP(K3,Table!F:G,2,FALSE)&VLOOKUP(L3,Table!B:D,3,FALSE)","v":"07545"},750,450,24500,{"$f":"M3*1.3","v":31850},2,"075",2]
[null,"定価（税抜き）",1,2,3,4,5,6,{"$f":"VLOOKUP(K4,Table!$F:$H,3,FALSE)&VLOOKUP(L4,Table!$B:$H,7,FALSE)","v":"31"},{"$f":"VLOOKUP(K4,Table!F:G,2,FALSE)&VLOOKUP(L4,Table!B:D,3,FALSE)","v":"11045"},1100,450,34000,44200,3,110,3]
[null,null,600,750,1100,1500,1800,2300,{"$f":"VLOOKUP(K5,Table!$F:$H,3,FALSE)&VLOOKUP(L5,Table!$B:$H,7,FALSE)","v":"41"},{"$f":"VLOOKUP(K5,Table!F:G,2,FALSE)&VLOOKUP(L5,Table!B:D,3,FALSE)","v":"15045"},1500,450,44000,57200,4,150,4]
[1,450,20000,24500,34000,44000,50000,64000,{"$f":"VLOOKUP(K6,Table!$F:$H,3,FALSE)&VLOOKUP(L6,Table!$B:$H,7,FALSE)","v":"51"},{"$f":"VLOOKUP(K6,Table!F:G,2,FALSE)&VLOOKUP(L6,Table!B:D,3,FALSE)","v":"18045"},1800,450,50000,65000,5,180,5]
[2,600,23000,28500,40000,52000,59500,76000,{"$f":"VLOOKUP(K7,Table!$F:$H,3,FALSE)&VLOOKUP(L7,Table!$B:$H,7,FALSE)","v":"61"},{"$f":"VLOOKUP(K7,Table!F:G,2,FALSE)&VLOOKUP(L7,Table!B:D,3,FALSE)","v":"23045"},2300,450,64000,83200,6,230]
[3,750,30000,36500,51000,66500,76500,97000,{"$f":"VLOOKUP(K8,Table!$F:$H,3,FALSE)&VLOOKUP(L8,Table!$B:$H,7,FALSE)","v":"12"},{"$f":"VLOOKUP(K8,Table!F:G,2,FALSE)&VLOOKUP(L8,Table!B:D,3,FALSE)","v":"06060"},600,600,23000,29900]
[4,900,35000,43000,61000,79000,90000,116000,{"$f":"VLOOKUP(K9,Table!$F:$H,3,FALSE)&VLOOKUP(L9,Table!$B:$H,7,FALSE)","v":"22"},{"$f":"VLOOKUP(K9,Table!F:G,2,FALSE)&VLOOKUP(L9,Table!B:D,3,FALSE)","v":"07560"},750,600,28500,37050]
[5,1100,37000,45000,64000,83000,95000,121000,{"$f":"VLOOKUP(K10,Table!$F:$H,3,FALSE)&VLOOKUP(L10,Table!$B:$H,7,FALSE)","v":"32"},{"$f":"VLOOKUP(K10,Table!F:G,2,FALSE)&VLOOKUP(L10,Table!B:D,3,FALSE)","v":"11060"},1100,600,40000,52000]
[null,null,null,null,null,null,null,null,{"$f":"VLOOKUP(K11,Table!$F:$H,3,FALSE)&VLOOKUP(L11,Table!$B:$H,7,FALSE)","v":"42"},{"$f":"VLOOKUP(K11,Table!F:G,2,FALSE)&VLOOKUP(L11,Table!B:D,3,FALSE)","v":"15060"},1500,600,52000,67600]
[null,null,null,null,null,null,null,null,{"$f":"VLOOKUP(K12,Table!$F:$H,3,FALSE)&VLOOKUP(L12,Table!$B:$H,7,FALSE)","v":"52"},{"$f":"VLOOKUP(K12,Table!F:G,2,FALSE)&VLOOKUP(L12,Table!B:D,3,FALSE)","v":"18060"},1800,600,59500,77350]
[null,null,null,2300,null,null,null,null,{"$f":"VLOOKUP(K13,Table!$F:$H,3,FALSE)&VLOOKUP(L13,Table!$B:$H,7,FALSE)","v":"62"},{"$f":"VLOOKUP(K13,Table!F:G,2,FALSE)&VLOOKUP(L13,Table!B:D,3,FALSE)","v":"23060"},2300,600,76000,98800]
[null,null,null,1800,null,null,null,null,{"$f":"VLOOKUP(K14,Table!$F:$H,3,FALSE)&VLOOKUP(L14,Table!$B:$H,7,FALSE)","v":"13"},{"$f":"VLOOKUP(K14,Table!F:G,2,FALSE)&VLOOKUP(L14,Table!B:D,3,FALSE)","v":"06075"},600,750,30000,39000]
[null,null,null,1500,null,null,null,null,{"$f":"VLOOKUP(K15,Table!$F:$H,3,FALSE)&VLOOKUP(L15,Table!$B:$H,7,FALSE)","v":"23"},{"$f":"VLOOKUP(K15,Table!F:G,2,FALSE)&VLOOKUP(L15,Table!B:D,3,FALSE)","v":"07575"},750,750,36500,47450]
[null,null,null,1100,null,null,null,null,{"$f":"VLOOKUP(K16,Table!$F:$H,3,FALSE)&VLOOKUP(L16,Table!$B:$H,7,FALSE)","v":"33"},{"$f":"VLOOKUP(K16,Table!F:G,2,FALSE)&VLOOKUP(L16,Table!B:D,3,FALSE)","v":"11075"},1100,750,51000,66300]
[null,null,null,750,null,null,null,null,{"$f":"VLOOKUP(K17,Table!$F:$H,3,FALSE)&VLOOKUP(L17,Table!$B:$H,7,FALSE)","v":"43"},{"$f":"VLOOKUP(K17,Table!F:G,2,FALSE)&VLOOKUP(L17,Table!B:D,3,FALSE)","v":"15075"},1500,750,66500,86450]
[null,null,null,600,null,null,null,null,{"$f":"VLOOKUP(K18,Table!$F:$H,3,FALSE)&VLOOKUP(L18,Table!$B:$H,7,FALSE)","v":"53"},{"$f":"VLOOKUP(K18,Table!F:G,2,FALSE)&VLOOKUP(L18,Table!B:D,3,FALSE)","v":"18075"},1800,750,76500,99450]
[null,null,null,null,null,null,null,null,{"$f":"VLOOKUP(K19,Table!$F:$H,3,FALSE)&VLOOKUP(L19,Table!$B:$H,7,FALSE)","v":"63"},{"$f":"VLOOKUP(K19,Table!F:G,2,FALSE)&VLOOKUP(L19,Table!B:D,3,FALSE)","v":"23075"},2300,750,97000,126100]
[null,null,null,null,null,null,null,null,{"$f":"VLOOKUP(K20,Table!$F:$H,3,FALSE)&VLOOKUP(L20,Table!$B:$H,7,FALSE)","v":"14"},{"$f":"VLOOKUP(K20,Table!F:G,2,FALSE)&VLOOKUP(L20,Table!B:D,3,FALSE)","v":"06090"},600,900,35000,45500]
{"$rows_left_out":13}
{"sheet":"図","index":9,"n_rows":23,"n_cols":49,"rows_kept":23,"cut":false,"hidden":true,"merged":[]}
[null,null,null,1,null,2,null,3,null,4,null,5,null,6,null,7,null,8,null,9,null,1,0,1,1,1,2,1,3,1,4,1,5,1,6,1,7,1,8,1,9,2,0,2,1,2,2,2,3]
[]
[null,1]
[]
[null,2]
[]
[null,3]
[]
[null,4]
[]
[null,5]
[]
[null,6]
[]
[null,7]
[]
[null,8]
[]
[null,9]
[]
{"$rows_left_out":4}
{"sheet":"C図","index":10,"n_rows":23,"n_cols":49,"rows_kept":23,"cut":false,"hidden":true,"merged":[]}
[null,null,null,1,null,2,null,3,null,4,null,5,null,6,null,7,null,8,null,9,null,1,0,1,1,1,2,1,3,1,4,1,5,1,6,1,7,1,8,1,9,2,0,2,1,2,2,2,3]
[]
[null,1]
[]
[null,2]
[]
[null,3]
[]
[null,4]
[]
[null,5]
[]
[null,6]
[]
[null,7]
[]
[null,8]
[]
[null,9]
[]
{"$rows_left_out":4}
{"sheet":"Cset図","index":11,"n_rows":48,"n_cols":49,"rows_kept":48,"cut":false,"hidden":true,"merged":[]}
[{"$f":"2300+1100+1100","v":4500},null,null,1,null,null,null,null,null,null,null,null,null,null,null,null,null,null,null,null,null,null,null,null,null,null,null,null,null,null,null,null,null,null,null,null,null,null,null,null,null,null,null,null,null,null,null,null,"E"]
[]
[null,1]
[]
[null,2]
[]
[null,3]
[]
[null,4]
[]
[null,5]
[]
[null,6]
[]
[null,7]
[]
[null,8]
[]
[null,9]
[]
{"$rows_left_out":29}
{"sheet":"CTable","index":12,"n_rows":12,"n_cols":10,"rows_kept":12,"cut":false,"hidden":true,"merged":[]}
[]
[]
["選択","奥行","図形行","記号",null,"巾","記号","Key"]
[0,null,0,null,null,null,null,null,null,450]
[1,450,5,45,null,600,"060",1,null,600]
[2,600,5,60,null,750,"075",2,null,750]
[3,750,6,75,null,1100,110,3,null,900]
[4,900,6,90,null,1500,150,4,null,1100]
[5,1100,7,"E1",null,1800,180,5]
[6,null,null,null,null,2300,230,6]
[7,200,5,20,null,300,"030",7]
[10,null,{"$f":"IF(#REF!=10,VLOOKUP(#REF!,CTable!A5:C9,3,FALSE),0)","v":{"$error":"#REF!"}}]

{"sheet":"C価格表","index":13,"n_rows":32,"n_cols":17,"rows_kept":32,"cut":false,"hidden":true,"merged":[]}
[null,null,null,null,null,null,null,null,"KEY","選択サイズ","W","H","標準単価","単価"]
[null,"人工銘木   価格表 (定価)",null,null,null,"コーナー",10000,null,{"$f":"MATCH(K2,$C$12:$C$18,-1)&MATCH(L2,$D$12:$D$18,-1)","v":"65"},{"$f":"VLOOKUP(K2,CTable!F:G,2,FALSE)&VLOOKUP(L2,CTable!B:D,3,FALSE)","v":"06045"},600,450,20000,{"$f":"M2*1.5+$G$2","v":40000}]
[null,null,null,null,null,null,null,null,"55",{"$f":"VLOOKUP(K3,CTable!F:G,2,FALSE)&VLOOKUP(L3,CTable!B:D,3,FALSE)","v":"07545"},750,450,24500,{"$f":"M3*1.5+$G$2","v":46750},null,"特注記号","倍率"]
[null,"定価（税抜き）",null,null,null,null,null,null,"45",{"$f":"VLOOKUP(K4,CTable!F:G,2,FALSE)&VLOOKUP(L4,CTable!B:D,3,FALSE)","v":"11045"},1100,450,34000,61000,null,"D",1.3]
[null,null,600,750,1100,1500,1800,2300,"35",{"$f":"VLOOKUP(K5,CTable!F:G,2,FALSE)&VLOOKUP(L5,CTable!B:D,3,FALSE)","v":"15045"},1500,450,44000,76000,null,"W",1.3]
[null,450,20000,24500,34000,44000,50000,64000,"25",{"$f":"VLOOKUP(K6,CTable!F:G,2,FALSE)&VLOOKUP(L6,CTable!B:D,3,FALSE)","v":"18045"},1800,450,50000,85000,null,"Z",1.5]
[null,600,23000,28500,40000,52000,59500,76000,"15",{"$f":"VLOOKUP(K7,CTable!F:G,2,FALSE)&VLOOKUP(L7,CTable!B:D,3,FALSE)","v":"23045"},2300,450,64000,106000,null,"N",1]
[null,750,30000,36500,51000,66500,76500,97000,"64",{"$f":"VLOOKUP(K8,CTable!F:G,2,FALSE)&VLOOKUP(L8,CTable!B:D,3,FALSE)","v":"06060"},600,600,23000,44500]
[null,900,35000,43000,61000,79000,90000,116000,"54",{"$f":"VLOOKUP(K9,CTable!F:G,2,FALSE)&VLOOKUP(L9,CTable!B:D,3,FALSE)","v":"07560"},750,600,28500,52750]
[null,1100,37000,45000,64000,83000,95000,121000,"44",{"$f":"VLOOKUP(K10,CTable!F:G,2,FALSE)&VLOOKUP(L10,CTable!B:D,3,FALSE)","v":"11060"},1100,600,40000,70000]
[null,null,"W","H","W記号","H記号",null,null,"34",{"$f":"VLOOKUP(K11,CTable!F:G,2,FALSE)&VLOOKUP(L11,CTable!B:D,3,FALSE)","v":"15060"},1500,600,52000,88000]
[null,1,2300,1100,230,"E1",null,null,"24",{"$f":"VLOOKUP(K12,CTable!F:G,2,FALSE)&VLOOKUP(L12,CTable!B:D,3,FALSE)","v":"18060"},1800,600,59500,99250]
[null,2,1800,900,180,90,null,null,"14",{"$f":"VLOOKUP(K13,CTable!F:G,2,FALSE)&VLOOKUP(L13,CTable!B:D,3,FALSE)","v":"23060"},2300,600,76000,124000]
[null,3,1500,750,150,75,null,null,"63",{"$f":"VLOOKUP(K14,CTable!F:G,2,FALSE)&VLOOKUP(L14,CTable!B:D,3,FALSE)","v":"06075"},600,750,30000,55000]
[null,4,1100,600,110,60,null,null,"53",{"$f":"VLOOKUP(K15,CTable!F:G,2,FALSE)&VLOOKUP(L15,CTable!B:D,3,FALSE)","v":"07575"},750,750,36500,64750]
[null,5,750,450,"075",45,null,null,"43",{"$f":"VLOOKUP(K16,CTable!F:G,2,FALSE)&VLOOKUP(L16,CTable!B:D,3,FALSE)","v":"11075"},1100,750,51000,86500]
[null,6,600,0,"060",null,null,null,"33",{"$f":"VLOOKUP(K17,CTable!F:G,2,FALSE)&VLOOKUP(L17,CTable!B:D,3,FALSE)","v":"15075"},1500,750,66500,109750]
[null,7,0,null,null,null,null,null,"23",{"$f":"VLOOKUP(K18,CTable!F:G,2,FALSE)&VLOOKUP(L18,CTable!B:D,3,FALSE)","v":"18075"},1800,750,76500,124750]
[null,null,null,null,null,null,null,null,"13",{"$f":"VLOOKUP(K19,CTable!F:G,2,FALSE)&VLOOKUP(L19,CTable!B:D,3,FALSE)","v":"23075"},2300,750,97000,155500]
[null,null,null,null,null,null,null,null,"62",{"$f":"VLOOKUP(K20,CTable!F:G,2,FALSE)&VLOOKUP(L20,CTable!B:D,3,FALSE)","v":"06090"},600,900,35000,62500]
{"$rows_left_out":13}
{"sheet":"木口形状","index":14,"n_rows":4,"n_cols":3,"rows_kept":4,"cut":false,"hidden":true,"merged":[]}
[]
[null,"波形(耳付き)","W"]
[null,"テーパー","T"]
[null,"垂直","S"]

{"sheet":"設定","index":15,"n_rows":4,"n_cols":3,"rows_kept":4,"cut":false,"hidden":true,"merged":[]}
[]
[null,"設定"]
[]
[null,"メンテモード",false]